{"text_format":"3","workbook":"xlsx","n_sheets":4,"sheets":["Data","Muszakok","Merolapok","SPC"],"not_rendered":{"macros":1,"defined_names":2},"read":"whole","date_system":"1900"}

{"sheet":"Data","index":0,"n_rows":161,"n_cols":9,"rows_kept":161,"merged":[[1,0,6,0],[1,1,6,1],[1,2,6,2],[1,6,6,6],[1,7,6,7],[1,8,6,8],[7,0,12,0],[7,1,12,1],[7,2,12,2],[7,6,12,6],[7,7,12,7],[7,8,12,8],[13,0,18,0],[13,1,18,1],[13,2,18,2],[13,6,18,6],[13,7,18,7],[13,8,18,8],[19,0,24,0],[19,1,24,1],[19,2,24,2],[19,6,24,6],[19,7,24,7],[19,8,24,8],[25,0,30,0],[25,1,30,1],[25,2,30,2],[25,6,30,6],[25,7,30,7],[25,8,30,8],[31,0,36,0],[31,1,36,1],[31,2,36,2],[31,6,36,6],[31,7,36,7],[31,8,36,8],[37,0,42,0],[37,1,42,1],[37,2,42,2],[37,6,42,6],[37,7,42,7],[37,8,42,8],[43,0,48,0],[43,1,48,1],[43,2,48,2],[43,6,48,6],[43,7,48,7],[43,8,48,8],[49,0,54,0],[49,1,54,1],[49,2,54,2],[49,6,54,6],[49,7,54,7],[49,8,54,8],[55,0,60,0],[55,1,60,1],[55,2,60,2],[55,6,60,6],[55,7,60,7],[55,8,60,8],[61,0,66,0],[61,1,66,1],[61,2,66,2],[61,6,66,6],[61,7,66,7],[61,8,66,8],[67,0,72,0],[67,1,72,1],[67,2,72,2],[67,6,72,6],[67,7,72,7],[67,8,72,8],[73,0,78,0],[73,1,78,1],[73,2,78,2],[73,6,78,6],[73,7,78,7],[73,8,78,8],[79,0,84,0],[79,1,84,1],[79,2,84,2],[79,6,84,6],[79,7,84,7],[79,8,84,8],[85,0,90,0],[85,1,90,1],[85,2,90,2],[85,6,90,6],[85,7,90,7],[85,8,90,8],[91,0,96,0],[91,1,96,1],[91,2,96,2],[91,6,96,6],[91,7,96,7],[91,8,96,8],[97,0,102,0],[97,1,102,1],[97,2,102,2],[97,6,102,6],[97,7,102,7],[97,8,102,8],[103,0,108,0],[103,1,108,1],[103,2,108,2],[103,6,108,6],[103,7,108,7],[103,8,108,8],[109,0,114,0],[109,1,114,1],[109,2,114,2],[109,6,114,6],[109,7,114,7],[109,8,114,8],[115,0,120,0],[115,1,120,1],[115,2,120,2],[115,6,120,6],[115,7,120,7],[115,8,120,8],[121,0,126,0],[121,1,126,1],[121,2,126,2],[121,6,126,6],[121,7,126,7],[121,8,126,8],[127,0,132,0],[127,1,132,1],[127,2,132,2],[127,6,132,6],[127,7,132,7],[127,8,132,8],[133,0,138,0],[133,1,138,1],[133,2,138,2],[133,6,138,6],[133,7,138,7],[133,8,138,8],[139,0,144,0],[139,1,144,1],[139,2,144,2],[139,6,144,6],[139,7,144,7],[139,8,144,8],[145,0,150,0],[145,1,150,1],[145,2,150,2],[145,6,150,6],[145,7,150,7],[145,8,150,8],[151,0,156,0],[151,1,156,1],[151,2,156,2],[151,6,156,6],[151,7,156,7],[151,8,156,8],[157,0,162,0],[157,1,162,1],[157,2,162,2],[157,6,162,6],[157,7,162,7],[157,8,162,8]]}
[" Gyártás kezdete","Muszakszorzó","E/N","Mérések időpontja","Mérőlap digitális aláírása","SPC lap ","Műszakvezetők","Sorvezetők","Megjegyzés(sorállás)"]
["2019.06.02. 06:00:00",null,"Nappal","2019-06-02T06:28:31.163","Van","2019-06-02T06:28:00.625","K Laszlo (McP/MSE4-MFO)","B Ferenc  (McP/MSE4-MFO)","01:27:33"]
[{"$nulls":3},"2019-06-02T10:24:44.926","Van","2019-06-02T10:24:15.479"]
[{"$nulls":3},"2019-06-02T14:24:23.604","Van","2019-06-02T14:23:48.991"]
[{"$nulls":3},"2019-06-02T16:21:23.537","Van","2019-06-02T16:20:50.507"]
[]
[]
["2019.06.02. 18:00:00",null,"Ejszaka","2019-06-02T19:46:43.085","Van","Nincs","Z Lajos (McP/MSE4-MFO)","O Andras (McP/MSE4-MFO)","08:05:48"]
[]
[]
[]
[]
[]
["2019.06.03. 06:00:00",null,"Nappal","2019-06-03T09:42:36.220","Van","2019-06-03T09:41:35.009","K Laszlo (McP/MSE4-MFO)","B Ferenc  (McP/MSE4-MFO)","02:05:15"]
[{"$nulls":3},"2019-06-03T12:17:55.686","Van","2019-06-03T12:17:18.166"]
[{"$nulls":3},"2019-06-03T16:19:58.224","Van","2019-06-03T16:19:26.576"]
[]
[]
[]
["2019.06.03. 18:00:00",null,"Ejszaka","2019-06-03T18:14:15.124","Van","Nincs","Z Lajos (McP/MSE4-MFO)","O Andras (McP/MSE4-MFO)","01:54:56"]
[{"$nulls":3},"2019-06-03T20:40:41.538","Van","Nincs"]
[{"$nulls":3},"2019-06-03T23:28:57.606","Van","Nincs"]
[{"$nulls":3},"2019-06-04T01:50:13.509","Van","Nincs"]
[{"$nulls":3},"2019-06-04T04:19:32.035","Van","Nincs"]
[]
["2019.06.04. 18:00:00",null,"Ejszaka","2019-06-04T18:41:28.966","Van","2019-06-04T18:41:01.398","M Dora (McP/MSE4-MFO)","B Ferenc  (McP/MSE4-MFO)"]
[{"$nulls":3},"2019-06-04T20:02:52.651","Van","2019-06-04T20:02:09.270"]
[{"$nulls":3},"2019-06-04T22:08:18.604","Van","2019-06-04T22:07:36.348"]
[{"$nulls":3},"2019-06-05T02:11:38.091","Van","2019-06-05T02:11:07.219"]
[{"$nulls":3},"2019-06-05T03:57:54.887","Van","2019-06-05T03:57:19.694"]
[]
["2019.06.06. 18:00:00",null,"Ejszaka","2019-06-06T18:32:17.845","Van","2019-06-06T18:31:48.243","K Laszlo (McP/MSE4-MFO)","B Ferenc  (McP/MSE4-MFO)"]
[{"$nulls":3},"2019-06-06T21:54:31.941","Van","2019-06-06T21:53:58.245"]
[{"$nulls":3},"2019-06-07T00:48:10.571","Van","2019-06-07T00:47:03.837"]
[{"$nulls":3},"2019-06-07T02:29:23.873","Van","2019-06-07T02:28:49.746"]
[]
[]
["2019.06.07. 18:00:00",null,"Ejszaka","2019-06-07T18:46:53.320","Van","2019-06-07T18:46:20.472","K Laszlo (McP/MSE4-MFO)","B Ferenc  (McP/MSE4-MFO)"]
[{"$nulls":3},"2019-06-07T20:04:46.117","Van","2019-06-07T20:04:10.918"]
[{"$nulls":3},"2019-06-07T21:57:06.225","Van","2019-06-07T21:56:30.673"]
[{"$nulls":3},"2019-06-08T02:21:00.409","Van","2019-06-08T02:20:27.577"]
[{"$nulls":3},"2019-06-08T04:36:01.227","Van","2019-06-08T04:35:26.421"]
[]
["2019.06.11. 06:00:00",null,"Nappal","2019-06-11T06:41:19.739","Van","2019-06-11T06:40:27.286","K Laszlo (McP/MSE4-MFO)","B Ferenc  (McP/MSE4-MFO)"]
[{"$nulls":3},"2019-06-11T07:55:23.626","Van","2019-06-11T07:54:50.640"]
[{"$nulls":3},"2019-06-11T10:34:00.885","Van","2019-06-11T10:33:26.992"]
[{"$nulls":3},"2019-06-11T14:39:35.931","Van","2019-06-11T14:38:39.734"]
[{"$nulls":3},"2019-06-11T16:17:54.361","Van","2019-06-11T16:17:07.317"]
[]
["2019.06.14. 18:00:00",null,"Ejszaka","2019-06-14T18:19:39.398","Van","2019-06-14T18:19:06.665","K Laszlo (McP/MSE4-MFO)","B Ferenc  (McP/MSE4-MFO)","00:33:44"]
[{"$nulls":3},"2019-06-14T20:21:03.683","Van","2019-06-14T20:20:21.951"]
[{"$nulls":3},"2019-06-14T22:33:39.639","Van","2019-06-14T22:33:09.564"]
[{"$nulls":3},"2019-06-15T00:50:29.643","Van","2019-06-15T00:49:31.412"]
[{"$nulls":3},"2019-06-15T05:27:03.846","Van","2019-06-15T05:26:31.770"]
[]
["2019.06.15. 18:00:00",null,"Ejszaka","2019-06-15T18:31:30.422","Van","2019-06-15T18:30:46.480","K Laszlo (McP/MSE4-MFO)","B Ferenc  (McP/MSE4-MFO)"]
[{"$nulls":3},"2019-06-15T20:37:26.242","Van","2019-06-15T20:35:56.390"]
[{"$nulls":3},"2019-06-16T01:49:07.075","Van","2019-06-16T01:48:36.405"]
[{"$nulls":3},"2019-06-16T04:34:12.628","Van","2019-06-16T04:33:36.354"]
[]
[]
["2019.06.16. 18:00:00",null,"Ejszaka","2019-06-16T19:05:45.037","Van","2019-06-16T19:05:15.474","T Lajos (McP/MSE4-MFO)","B Ferenc  (McP/MSE4-MFO)","00:15:03"]
[{"$nulls":3},"2019-06-16T20:30:34.064","Van","2019-06-16T20:30:03.139"]
[{"$nulls":3},"2019-06-17T01:41:53.654","Van","2019-06-17T01:40:37.875"]
[]
[]
[]
["2019.06.18. 06:00:00",null,"Nappal","2019-06-18T06:55:24.975","Van","2019-06-18T06:54:52.520","K Laszlo (McP/MSE4-MFO)","B Ferenc  (McP/MSE4-MFO)","00:15:27"]
[{"$nulls":3},"2019-06-18T12:36:26.664","Van","2019-06-18T12:35:58.224"]
[{"$nulls":3},"2019-06-18T14:12:09.991","Van","2019-06-18T14:11:15.856"]
[{"$nulls":3},"2019-06-18T16:23:13.508","Van","2019-06-18T16:22:40.782"]
[]
[]
["2019.06.19. 06:00:00",null,"Nappal",{"$nulls":3},"K Laszlo (McP/MSE4-MFO)","B Ferenc  (McP/MSE4-MFO)"]
[]
[{"$nulls":3},"2019-06-19T06:18:33.719","Van","2019-06-19T06:17:58.753"]
[{"$nulls":3},"2019-06-19T09:57:19.372","Van","2019-06-19T09:56:49.542"]
[{"$nulls":3},"2019-06-19T12:23:09.992","Van","2019-06-19T12:22:37.001"]
[{"$nulls":3},"2019-06-19T13:57:46.975","Van","2019-06-19T13:57:06.744"]
["2019.06.22. 18:00:00",null,"Ejszaka","2019-06-22T18:20:08.788","Van","2019-06-22T18:19:26.211","K Laszlo (McP/MSE4-MFO)","B Ferenc  (McP/MSE4-MFO)"]
[{"$nulls":3},"2019-06-22T20:11:16.456","Van","2019-06-22T20:08:50.139"]
[{"$nulls":3},"2019-06-23T00:32:17.408","Van","2019-06-23T00:31:43.240"]
[{"$nulls":3},"2019-06-23T02:36:36.025","Van","2019-06-23T02:36:02.733"]
[{"$nulls":3},"2019-06-23T03:51:25.072","Nincs","2019-06-23T03:56:22.075"]
[{"$nulls":3},"2019-06-23T03:57:26.590","Van","2019-06-23T03:58:02.936"]
["2019.06.23. 06:00:00",null,"Nappal","2019-06-23T06:18:37.477","Van","Nincs","Z Lajos (McP/MSE4-MFO)","O Andras (McP/MSE4-MFO)"]
[{"$nulls":3},"2019-06-23T08:19:24.508","Van","Nincs"]
[{"$nulls":3},"2019-06-23T09:58:40.946","Van","Nincs"]
[{"$nulls":3},"2019-06-23T11:53:30.914","Van","Nincs"]
[{"$nulls":3},"2019-06-23T13:58:46.414","Van","Nincs"]
[{"$nulls":3},"2019-06-23T16:02:54.833","Van","Nincs"]
["2019.06.23. 18:00:00",null,"Ejszaka","2019-06-23T18:23:51.622","Van","2019-06-23T18:23:21.618","K Laszlo (McP/MSE4-MFO)","B Ferenc  (McP/MSE4-MFO)"]
[{"$nulls":3},"2019-06-24T01:11:27.073","Van","2019-06-24T01:09:28.999"]
[{"$nulls":3},"2019-06-24T02:47:31.350","Van","2019-06-24T02:46:54.738"]
[{"$nulls":3},"2019-06-24T04:33:54.555","Van","2019-06-24T04:33:20.574"]
[]
[]
["2019.06.26. 06:00:00",null,"Nappal","2019-06-26T07:09:01.658","Van","2019-06-26T07:12:33","K Laszlo (McP/MSE4-MFO)","Sz Laszlo (McP/MSE4-MFO)"]
[{"$nulls":3},"2019-06-26T08:21:08.888","Van","2019-06-26T08:22:16.781"]
[{"$nulls":3},"2019-06-26T10:18:48.605","Van","2019-06-26T10:19:47.888"]
[{"$nulls":3},"2019-06-26T12:06:37.071","Van","2019-06-26T12:07:49.105"]
[{"$nulls":3},"2019-06-26T14:43:30.358","Van","2019-06-26T14:44:33.405"]
[{"$nulls":3},"2019-06-26T16:20:55.077","Van","2019-06-26T16:24:57.215"]
["2019.06.27. 06:00:00",null,"Nappal","2019-06-27T06:20:49.167","Van","2019-06-27T06:20:12.466","K Laszlo (McP/MSE4-MFO)","B Ferenc  (McP/MSE4-MFO)"]
[{"$nulls":3},"2019-06-27T09:35:48.886","Van","2019-06-27T09:35:17.440"]
[{"$nulls":3},"2019-06-27T11:48:13.661","Van","2019-06-27T11:47:40.792"]
[{"$nulls":3},"2019-06-27T16:01:24.902","Van","2019-06-27T16:00:38.870"]
[]
[]
["2019.06.27. 18:00:00",null,"Ejszaka","2019-06-27T18:16:21.996","Van","Nincs","Z Lajos (McP/MSE4-MFO)","O Andras (McP/MSE4-MFO)","00:18:01"]
[{"$nulls":3},"2019-06-27T19:59:49.566","Van","Nincs"]
[{"$nulls":3},"2019-06-27T22:22:07.577","Van","Nincs"]
[{"$nulls":3},"2019-06-28T00:28:23.566","Van","Nincs"]
[{"$nulls":3},"2019-06-28T02:32:21.800","Van","Nincs"]
[{"$nulls":3},"2019-06-28T05:20:11.343","Van","Nincs"]
["2019.06.28. 06:00:00",null,"Nappal","2019-06-28T06:32:37.449","Van","2019-06-28T06:32:02.816","T Lajos (McP/MSE4-MFO)","B Ferenc  (McP/MSE4-MFO)","00:20:30"]
[{"$nulls":3},"2019-06-28T08:14:41.793","Van","2019-06-28T08:13:50.077"]
[{"$nulls":3},"2019-06-28T10:04:03.504","Van","2019-06-28T10:03:26.332"]
[{"$nulls":3},"2019-06-28T12:44:51.319","Van","2019-06-28T12:44:08.527"]
[{"$nulls":3},"2019-06-28T14:04:49.898","Van","2019-06-28T14:04:17.276"]
[{"$nulls":3},"2019-06-28T16:23:47.031","Van","2019-06-28T16:23:13.708"]
["2019.06.30. 18:00:00",null,"Ejszaka","2019-06-30T20:11:46.587","Van","2019-06-30T20:11:15.669","K Laszlo (McP/MSE4-MFO)","B Ferenc  (McP/MSE4-MFO)"]
[{"$nulls":3},"2019-06-30T21:50:06.328","Van","2019-06-30T21:49:31.411"]
[{"$nulls":3},"2019-07-01T00:41:26.391","Van","2019-07-01T00:40:56.914"]
[{"$nulls":3},"2019-07-01T02:32:25.682","Van","2019-07-01T02:31:49.234"]
[{"$nulls":3},"2019-07-01T04:31:14.510","Van","2019-07-01T04:30:40.605"]
[]
["2019.07.01. 18:00:00",null,"Ejszaka","2019-07-01T18:55:33.104","Van","2019-07-01T18:55:01.511","K Laszlo (McP/MSE4-MFO)","B Ferenc  (McP/MSE4-MFO)","00:10:57"]
[{"$nulls":3},"2019-07-01T20:22:54.874","Van","2019-07-01T20:22:24.078"]
[{"$nulls":3},"2019-07-01T22:41:41.081","Van","2019-07-01T22:41:02.561"]
[{"$nulls":3},"2019-07-02T05:13:02.821","Van","2019-07-02T05:12:30.101"]
[]
[]
["2019.07.04. 06:00:00",null,"Nappal","2019-07-04T06:19:35.686","Van","2019-07-04T06:19:01.772","K Laszlo (McP/MSE4-MFO)","B Ferenc  (McP/MSE4-MFO)"]
[{"$nulls":3},"2019-07-04T08:34:05.850","Van","2019-07-04T08:33:23.267"]
[{"$nulls":3},"2019-07-04T10:27:00.763","Van","2019-07-04T10:26:31.907"]
[{"$nulls":3},"2019-07-04T14:25:09.745","Van","2019-07-04T14:24:38.420"]
[{"$nulls":3},"2019-07-04T16:30:47.648","Van","2019-07-04T16:30:15.226"]
[]
["2019.07.05. 06:00:00",null,"Nappal","2019-07-05T06:17:46.493","Van","2019-07-05T06:17:13.069","K Laszlo (McP/MSE4-MFO)","B Ferenc  (McP/MSE4-MFO)","00:16:12"]
[{"$nulls":3},"2019-07-05T08:49:10.341","Van","2019-07-05T08:48:39.151"]
[{"$nulls":3},"2019-07-05T10:24:36.127","Van","2019-07-05T10:23:57.508"]
[{"$nulls":3},"2019-07-05T12:16:41.483","Van","2019-07-05T12:16:04.364"]
[{"$nulls":3},"2019-07-05T16:46:02.197","Van","2019-07-05T16:45:13.585"]
[]
["2019.07.08. 18:00:00",null,"Ejszaka","2019-07-08T18:23:11.974","Van","2019-07-08T18:22:26.330","K Laszlo (McP/MSE4-MFO)","B Ferenc  (McP/MSE4-MFO)","00:20:34"]
[{"$nulls":3},"2019-07-08T20:52:47.221","Van","2019-07-08T20:52:15.184"]
[{"$nulls":3},"2019-07-08T22:43:57.102","Van","2019-07-08T22:43:23.469"]
[{"$nulls":3},"2019-07-09T02:30:46.798","Van","2019-07-09T02:30:13.167"]
[{"$nulls":3},"2019-07-09T04:23:17.340","Van","2019-07-09T04:22:40.511"]
[]
["2019.07.12. 06:00:00",null,"Nappal","2019-07-12T07:23:41","Nincs","2019-07-12T07:28:45.954","K Laszlo (McP/MSE4-MFO)","Sz Laszlo (McP/MSE4-MFO)"]
[{"$nulls":3},"2019-07-12T12:36:09","Nincs","2019-07-12T12:37:25.046"]
[{"$nulls":3},"2019-07-12T15:25:45","Nincs","2019-07-12T15:26:51.030"]
[]
[]
[]
["2019.07.13. 06:00:00",null,"Nappal","2019-07-13T06:19:33.006","Van","2019-07-13T06:18:53.896","K Laszlo (McP/MSE4-MFO)","B Ferenc  (McP/MSE4-MFO)","00:09:25"]
[{"$nulls":3},"2019-07-13T08:14:06.367","Van","2019-07-13T08:13:33.055"]
[{"$nulls":3},"2019-07-13T13:15:10.040","Van","2019-07-13T13:14:22.603"]
[{"$nulls":3},"2019-07-13T16:04:33.376","Van","2019-07-13T16:03:59.654"]

{"sheet":"Muszakok","index":1,"n_rows":28,"n_cols":13,"rows_kept":28}
["Kezdete","Vége","Műszakvezető","Sorvezető","Nem terv. állás","Időpont év","hónap","nap","óra","perc","Egyben","E/N","Muszakszorzok"]
["2019.06.02. 06:00:00","2019.06.02. 18:00:00","K Laszlo (McP/MSE4-MFO)","B Ferenc  (McP/MSE4-MFO)","01:27:33",19,6,2,6,0,190602,{"$f":"IF(I2<6,\"Ejszaka\",IF(I2<18,\"Nappal\",\"Ejszaka\"))","v":"Nappal"},{"$f":"IF(L2=\"Nappal\",K2*10,K2*100)","v":1906020}]
["2019.06.02. 18:00:00","2019.06.03. 06:00:00","Z Lajos (McP/MSE4-MFO)","O Andras (McP/MSE4-MFO)","08:05:48",19,6,2,18,0,190602,{"$f":"IF(I3<6,\"Ejszaka\",IF(I3<18,\"Nappal\",\"Ejszaka\"))","v":"Ejszaka"},{"$f":"IF(L3=\"Nappal\",K3*10,K3*100)","v":19060200}]
["2019.06.03. 06:00:00","2019.06.03. 18:00:00","K Laszlo (McP/MSE4-MFO)","B Ferenc  (McP/MSE4-MFO)","02:05:15",19,6,3,6,0,190603,"Nappal",{"$f":"IF(L4=\"Nappal\",K4*10,K4*100)","v":1906030}]
["2019.06.03. 18:00:00","2019.06.04. 06:00:00","Z Lajos (McP/MSE4-MFO)","O Andras (McP/MSE4-MFO)","01:54:56",19,6,3,18,0,190603,"Ejszaka",{"$f":"IF(L5=\"Nappal\",K5*10,K5*100)","v":19060300}]
["2019.06.04. 18:00:00","2019.06.05. 06:00:00","M Dora (McP/MSE4-MFO)","B Ferenc  (McP/MSE4-MFO)",null,19,6,4,18,0,190604,"Ejszaka",19060400]
["2019.06.06. 18:00:00","2019.06.07. 06:00:00","K Laszlo (McP/MSE4-MFO)","B Ferenc  (McP/MSE4-MFO)",null,19,6,6,18,0,190606,"Ejszaka",19060600]
["2019.06.07. 18:00:00","2019.06.08. 06:00:00","K Laszlo (McP/MSE4-MFO)","B Ferenc  (McP/MSE4-MFO)",null,19,6,7,18,0,190607,"Ejszaka",19060700]
["2019.06.11. 06:00:00","2019.06.11. 18:00:00","K Laszlo (McP/MSE4-MFO)","B Ferenc  (McP/MSE4-MFO)",null,19,6,11,6,0,190611,"Nappal",1906110]
["2019.06.14. 18:00:00","2019.06.15. 06:00:00","K Laszlo (McP/MSE4-MFO)","B Ferenc  (McP/MSE4-MFO)","00:33:44",19,6,14,18,0,190614,"Ejszaka",19061400]
["2019.06.15. 18:00:00","2019.06.16. 06:00:00","K Laszlo (McP/MSE4-MFO)","B Ferenc  (McP/MSE4-MFO)",null,19,6,15,18,0,190615,"Ejszaka",19061500]
["2019.06.16. 18:00:00","2019.06.17. 06:00:00","T Lajos (McP/MSE4-MFO)","B Ferenc  (McP/MSE4-MFO)","00:15:03",19,6,16,18,0,190616,"Ejszaka",19061600]
["2019.06.18. 06:00:00","2019.06.18. 18:00:00","K Laszlo (McP/MSE4-MFO)","B Ferenc  (McP/MSE4-MFO)","00:15:27",19,6,18,6,0,190618,"Nappal",1906180]
["2019.06.19. 06:00:00","2019.06.19. 18:00:00","K Laszlo (McP/MSE4-MFO)","B Ferenc  (McP/MSE4-MFO)",null,19,6,19,6,0,190619,"Nappal",1906190]
["2019.06.22. 18:00:00","2019.06.23. 06:00:00","K Laszlo (McP/MSE4-MFO)","B Ferenc  (McP/MSE4-MFO)",null,19,6,22,18,0,190622,"Ejszaka",19062200]
["2019.06.23. 06:00:00","2019.06.23. 18:00:00","Z Lajos (McP/MSE4-MFO)","O Andras (McP/MSE4-MFO)",null,19,6,23,6,0,190623,"Nappal",{"$f":"IF(L16=\"Nappal\",K16*10,K16*100)","v":1906230}]
["2019.06.23. 18:00:00","2019.06.24. 06:00:00","K Laszlo (McP/MSE4-MFO)","B Ferenc  (McP/MSE4-MFO)",null,19,6,23,18,0,190623,"Ejszaka",19062300]
["2019.06.26. 06:00:00","2019.06.26. 18:00:00","K Laszlo (McP/MSE4-MFO)","Sz Laszlo (McP/MSE4-MFO)",null,19,6,26,6,0,190626,"Nappal",1906260]
["2019.06.27. 06:00:00","2019.06.27. 18:00:00","K Laszlo (McP/MSE4-MFO)","B Ferenc  (McP/MSE4-MFO)",null,19,6,27,6,0,190627,"Nappal",1906270]
["2019.06.27. 18:00:00","2019.06.28. 06:00:00","Z Lajos (McP/MSE4-MFO)","O Andras (McP/MSE4-MFO)","00:18:01",19,6,27,18,0,190627,"Ejszaka",19062700]
["2019.06.28. 06:00:00","2019.06.28. 18:00:00","T Lajos (McP/MSE4-MFO)","B Ferenc  (McP/MSE4-MFO)","00:20:30",19,6,28,6,0,190628,"Nappal",1906280]
["2019.06.30. 18:00:00","2019.07.01. 06:00:00","K Laszlo (McP/MSE4-MFO)","B Ferenc  (McP/MSE4-MFO)",null,19,6,30,18,0,190630,"Ejszaka",19063000]
["2019.07.01. 18:00:00","2019.07.02. 06:00:00","K Laszlo (McP/MSE4-MFO)","B Ferenc  (McP/MSE4-MFO)","00:10:57",19,7,1,18,0,190701,"Ejszaka",19070100]
["2019.07.04. 06:00:00","2019.07.04. 18:00:00","K Laszlo (McP/MSE4-MFO)","B Ferenc  (McP/MSE4-MFO)",null,19,7,4,6,0,190704,"Nappal",1907040]
["2019.07.05. 06:00:00","2019.07.05. 18:00:00","K Laszlo (McP/MSE4-MFO)","B Ferenc  (McP/MSE4-MFO)","00:16:12",19,7,5,6,0,190705,"Nappal",1907050]
["2019.07.08. 18:00:00","2019.07.09. 06:00:00","K Laszlo (McP/MSE4-MFO)","B Ferenc  (McP/MSE4-MFO)","00:20:34",19,7,8,18,0,190708,"Ejszaka",19070800]
["2019.07.12. 06:00:00","2019.07.12. 18:00:00","K Laszlo (McP/MSE4-MFO)","Sz Laszlo (McP/MSE4-MFO)",null,19,7,12,6,0,190712,"Nappal",1907120]
["2019.07.13. 06:00:00","2019.07.13. 18:00:00","K Laszlo (McP/MSE4-MFO)","B Ferenc  (McP/MSE4-MFO)","00:09:25",19,7,13,6,0,190713,"Nappal",1907130]

{"sheet":"Merolapok","index":2,"n_rows":436,"n_cols":21,"rows_kept":436}
["Name","Extension","Date accessed","Date modified","Date created","Folder Path","Datum","Év","Hónap","Nap","Óra","Perc","Műszak","Év","Hónap","Nap","Óra","Perc","Műszak","Datum","Datum+muszak"]
["Mérőlap_MSE4_A1_1901041121.pdf",".pdf","2019-07-31T13:55:31.671","2019-01-04T11:21:01.193","2019-07-18T07:25:49.897","U:\\Merolapok motorsor\\Anker 1\\Merolapok\\",{"$f":"MID(A2,17,10)","v":"1901041121"},2019,{"$f":"MID(G2,4,1)","v":"1"},{"$f":"MID(G2,5,2)","v":"04"},{"$f":"MID(G2,7,2)","v":"11"},{"$f":"MID(G2,9,2)","v":"21"},null,2019,1,4,11,21,{"$f":"IF(Q2<6,\"Ejszaka\",IF(Q2<18,\"Nappal\",\"Ejszaka\"))","v":"Nappal"},{"$f":"MID(G2,1,6)","v":"190104"},{"$f":"IF(S2=\"Nappal\",T2*10,IF(Q2<6,T2*100-100,T2*100))","v":1901040}]
["Mérőlap_MSE4_A1_1901132025.pdf",".pdf","2019-07-31T13:55:33.002","2019-01-13T20:27:10.093","2019-07-18T07:25:50.879","U:\\Merolapok motorsor\\Anker 1\\Merolapok\\",{"$f":"MID(A3,17,10)","v":"1901132025"},2019,"1","13",{"$f":"MID(G3,7,2)","v":"20"},"25",null,2019,1,13,20,25,{"$f":"IF(Q3<6,\"Ejszaka\",IF(Q3<18,\"Nappal\",\"Ejszaka\"))","v":"Ejszaka"},"190113",{"$f":"IF(S3=\"Nappal\",T3*10,IF(Q3<6,T3*100-100,T3*100))","v":19011300}]
["Mérőlap_MSE4_A1_1901132214.pdf",".pdf","2019-07-31T13:55:34.389","2019-01-13T22:15:50.226","2019-07-18T07:25:51.637","U:\\Merolapok motorsor\\Anker 1\\Merolapok\\","1901132214",2019,"1","13","22","14",null,2019,1,13,22,14,"Ejszaka","190113",19011300]
["Mérőlap_MSE4_A1_1901140033.pdf",".pdf","2019-07-31T13:55:35.685","2019-01-14T00:34:28.170","2019-07-18T07:25:52.433","U:\\Merolapok motorsor\\Anker 1\\Merolapok\\","1901140033",2019,"1","14","00","33",null,2019,1,14,0,33,{"$f":"IF(Q5<6,\"Ejszaka\",IF(Q5<18,\"Nappal\",\"Ejszaka\"))","v":"Ejszaka"},"190114",19011300]
["Mérőlap_MSE4_A1_1901140232.pdf",".pdf","2019-07-31T13:55:36.796","2019-01-14T02:33:51.664","2019-07-18T07:25:53.329","U:\\Merolapok motorsor\\Anker 1\\Merolapok\\","1901140232",2019,"1","14","02","32",null,2019,1,14,2,32,{"$f":"IF(Q6<6,\"Ejszaka\",IF(Q6<18,\"Nappal\",\"Ejszaka\"))","v":"Ejszaka"},"190114",19011300]
["Mérőlap_MSE4_A1_1901291829.pdf",".pdf","2019-07-31T13:55:37.735","2019-01-29T18:31:02.368","2019-07-18T07:25:54.178","U:\\Merolapok motorsor\\Anker 1\\Merolapok\\","1901291829",2019,"1","29","18","29",null,2019,1,29,18,29,"Ejszaka","190129",19012900]
["Mérőlap_MSE4_A1_1901292118.pdf",".pdf","2019-07-31T13:55:38.791","2019-01-29T21:19:11.545","2019-07-18T07:25:55.058","U:\\Merolapok motorsor\\Anker 1\\Merolapok\\","1901292118",2019,"1","29","21","18",null,2019,1,29,21,18,"Ejszaka","190129",19012900]
["Mérőlap_MSE4_A1_1901300226.pdf",".pdf","2019-07-31T13:55:39.835","2019-01-30T02:27:33.041","2019-07-18T07:25:56.185","U:\\Merolapok motorsor\\Anker 1\\Merolapok\\","1901300226",2019,"1","30","02","26",null,2019,1,30,2,26,"Ejszaka","190130",19012900]
["Mérőlap_MSE4_A1_1901300423.pdf",".pdf","2019-07-31T13:55:40.939","2019-01-30T04:24:17.370","2019-07-18T07:25:57.134","U:\\Merolapok motorsor\\Anker 1\\Merolapok\\","1901300423",2019,"1","30","04","23",null,2019,1,30,4,23,"Ejszaka","190130",19012900]
["Mérőlap_MSE4_A1_1902020628.pdf",".pdf","2019-07-31T13:55:42.094","2019-02-02T06:28:59.649","2019-07-18T07:25:58.153","U:\\Merolapok motorsor\\Anker 1\\Merolapok\\","1902020628",2019,"2","02","06","28",null,2019,2,2,6,28,"Nappal","190202",1902020]
["Mérőlap_MSE4_A1_1902020755.pdf",".pdf","2019-07-31T13:55:43.545","2019-02-02T07:56:30.540","2019-07-18T07:25:59.238","U:\\Merolapok motorsor\\Anker 1\\Merolapok\\","1902020755",2019,"2","02","07","55",null,2019,2,2,7,55,"Nappal","190202",1902020]
["Mérőlap_MSE4_A1_1902021030.pdf",".pdf","2019-07-31T13:55:44.537","2019-02-02T10:31:44.763","2019-07-18T07:26:00.111","U:\\Merolapok motorsor\\Anker 1\\Merolapok\\","1902021030",2019,"2","02","10","30",null,2019,2,2,10,30,"Nappal","190202",1902020]
["Mérőlap_MSE4_A1_1902021422.pdf",".pdf","2019-07-31T13:55:45.545","2019-02-02T14:23:11.666","2019-07-18T07:26:01.127","U:\\Merolapok motorsor\\Anker 1\\Merolapok\\","1902021422",2019,"2","02","14","22",null,2019,2,2,14,22,"Nappal","190202",1902020]
["Mérőlap_MSE4_A1_1902021607.pdf",".pdf","2019-07-31T13:55:46.794","2019-02-02T16:08:26.611","2019-07-18T07:26:02.173","U:\\Merolapok motorsor\\Anker 1\\Merolapok\\","1902021607",2019,"2","02","16","07",null,2019,2,2,16,7,"Nappal","190202",1902020]
["Mérőlap_MSE4_A1_1902030623.pdf",".pdf","2019-07-31T13:55:47.980","2019-02-03T06:24:19.646","2019-07-18T07:26:03.110","U:\\Merolapok motorsor\\Anker 1\\Merolapok\\","1902030623",2019,"2","03","06","23",null,2019,2,3,6,23,"Nappal","190203",1902030]
["Mérőlap_MSE4_A1_1902030815.pdf",".pdf","2019-07-31T13:55:49.243","2019-02-03T08:16:11.983","2019-07-18T07:26:04.076","U:\\Merolapok motorsor\\Anker 1\\Merolapok\\","1902030815",2019,"2","03","08","15",null,2019,2,3,8,15,"Nappal","190203",1902030]
["Mérőlap_MSE4_A1_1902031011.pdf",".pdf","2019-07-31T13:55:50.420","2019-02-03T10:12:06.680","2019-07-18T07:26:05.164","U:\\Merolapok motorsor\\Anker 1\\Merolapok\\","1902031011",2019,"2","03","10","11",null,2019,2,3,10,11,"Nappal","190203",1902030]
["Mérőlap_MSE4_A1_1902031221.pdf",".pdf","2019-07-31T13:55:51.693","2019-02-03T12:23:15.243","2019-07-18T07:26:06.040","U:\\Merolapok motorsor\\Anker 1\\Merolapok\\","1902031221",2019,"2","03","12","21",null,2019,2,3,12,21,"Nappal","190203",1902030]
["Mérőlap_MSE4_A1_1902031412.pdf",".pdf","2019-07-31T13:55:53.070","2019-02-03T14:14:04.014","2019-07-18T07:26:06.978","U:\\Merolapok motorsor\\Anker 1\\Merolapok\\","1902031412",2019,"2","03","14","12",null,2019,2,3,14,12,"Nappal","190203",1902030]
["Mérőlap_MSE4_A1_1902031609.pdf",".pdf","2019-07-31T13:55:54.443","2019-02-03T16:10:47.751","2019-07-18T07:26:07.939","U:\\Merolapok motorsor\\Anker 1\\Merolapok\\","1902031609",2019,"2","03","16","09",null,2019,2,3,16,9,"Nappal","190203",1902030]
["Mérőlap_MSE4_A1_1902061848.pdf",".pdf","2019-07-31T13:55:55.580","2019-02-06T18:49:29.767","2019-07-18T07:26:08.839","U:\\Merolapok motorsor\\Anker 1\\Merolapok\\","1902061848",2019,"2","06","18","48",null,2019,2,6,18,48,"Ejszaka","190206",19020600]
["Mérőlap_MSE4_A1_1902062015.pdf",".pdf","2019-07-31T13:55:57.215","2019-02-06T20:16:11.401","2019-07-18T07:26:09.868","U:\\Merolapok motorsor\\Anker 1\\Merolapok\\","1902062015",2019,"2","06","20","15",null,2019,2,6,20,15,"Ejszaka","190206",19020600]
["Mérőlap_MSE4_A1_1902062226.pdf",".pdf","2019-07-31T13:55:58.346","2019-02-06T22:27:07.143","2019-07-18T07:26:10.901","U:\\Merolapok motorsor\\Anker 1\\Merolapok\\","1902062226",2019,"2","06","22","26",null,2019,2,6,22,26,"Ejszaka","190206",19020600]
["Mérőlap_MSE4_A1_1902070027.pdf",".pdf","2019-07-31T13:55:59.314","2019-02-07T00:28:58.966","2019-07-18T07:26:11.943","U:\\Merolapok motorsor\\Anker 1\\Merolapok\\","1902070027",2019,"2","07","00","27",null,2019,2,7,0,27,"Ejszaka","190207",19020600]
["Mérőlap_MSE4_A1_1902070436.pdf",".pdf","2019-07-31T13:56:00.383","2019-02-07T04:37:45.209","2019-07-18T07:26:12.900","U:\\Merolapok motorsor\\Anker 1\\Merolapok\\","1902070436",2019,"2","07","04","36",null,2019,2,7,4,36,"Ejszaka","190207",19020600]
["Mérőlap_MSE4_A1_1902071838.pdf",".pdf","2019-07-31T13:56:01.346","2019-02-07T18:38:54.184","2019-07-18T07:26:13.709","U:\\Merolapok motorsor\\Anker 1\\Merolapok\\","1902071838",2019,"2","07","18","38",null,2019,2,7,18,38,"Ejszaka","190207",19020700]
["Mérőlap_MSE4_A1_1902072039.pdf",".pdf","2019-07-31T13:56:02.279","2019-02-07T20:40:46.915","2019-07-18T07:26:14.478","U:\\Merolapok motorsor\\Anker 1\\Merolapok\\","1902072039",2019,"2","07",{"$f":"MID(G28,7,2)","v":"20"},"39",null,2019,2,7,20,39,"Ejszaka","190207",19020700]
["Mérőlap_MSE4_A1_1902080043.pdf",".pdf","2019-07-31T13:56:03.268","2019-02-08T00:44:49.281","2019-07-18T07:26:15.502","U:\\Merolapok motorsor\\Anker 1\\Merolapok\\","1902080043",2019,"2","08","00","43",null,2019,2,8,0,43,"Ejszaka","190208",19020700]
["Mérőlap_MSE4_A1_1902080348.pdf",".pdf","2019-07-31T13:56:04.391","2019-02-08T03:49:22.816","2019-07-18T07:26:16.537","U:\\Merolapok motorsor\\Anker 1\\Merolapok\\","1902080348",2019,"2","08","03","48",null,2019,2,8,3,48,"Ejszaka","190208",19020700]
["Mérőlap_MSE4_A1_1902110634.pdf",".pdf","2019-07-31T13:56:05.464","2019-02-11T06:35:20.743","2019-07-18T07:26:17.392","U:\\Merolapok motorsor\\Anker 1\\Merolapok\\","1902110634",2019,"2","11","06","34",null,2019,2,11,6,34,"Nappal","190211",1902110]
["Mérőlap_MSE4_A1_1902111152.pdf",".pdf","2019-07-18T07:26:18.502","2019-02-11T11:53:02.799","2019-07-18T07:26:18.236","U:\\Merolapok motorsor\\Anker 1\\Merolapok\\","1902111152",2019,"2","11","11","52",null,2019,2,11,11,52,"Nappal","190211",1902110]
["Mérőlap_MSE4_A1_1902111434.pdf",".pdf","2019-07-18T07:26:19.305","2019-02-11T14:34:12.637","2019-07-18T07:26:19.031","U:\\Merolapok motorsor\\Anker 1\\Merolapok\\","1902111434",2019,"2","11","14","34",null,2019,2,11,14,34,"Nappal","190211",1902110]
["Mérőlap_MSE4_A1_1902111628.pdf",".pdf","2019-07-18T07:26:20.040","2019-02-11T16:28:55.743","2019-07-18T07:26:19.748","U:\\Merolapok motorsor\\Anker 1\\Merolapok\\","1902111628",2019,"2","11","16","28",null,2019,2,11,16,28,"Nappal","190211",1902110]
["Mérőlap_MSE4_A1_1902141823.pdf",".pdf","2019-07-18T07:26:20.789","2019-02-14T18:24:09.861","2019-07-18T07:26:20.534","U:\\Merolapok motorsor\\Anker 1\\Merolapok\\","1902141823",2019,"2","14","18","23",null,2019,2,14,18,23,"Ejszaka","190214",19021400]
["Mérőlap_MSE4_A1_1902142209.pdf",".pdf","2019-07-18T07:26:21.521","2019-02-14T22:10:35.891","2019-07-18T07:26:21.301","U:\\Merolapok motorsor\\Anker 1\\Merolapok\\","1902142209",2019,"2","14","22","09",null,2019,2,14,22,9,"Ejszaka","190214",19021400]
["Mérőlap_MSE4_A1_1902150034.pdf",".pdf","2019-07-18T07:26:22.325","2019-02-15T00:35:43.356","2019-07-18T07:26:22.047","U:\\Merolapok motorsor\\Anker 1\\Merolapok\\","1902150034",2019,"2","15","00","34",null,2019,2,15,0,34,"Ejszaka","190215",19021400]
["Mérőlap_MSE4_A1_1902150249.pdf",".pdf","2019-07-18T07:26:23.057","2019-02-15T02:49:10.382","2019-07-18T07:26:22.839","U:\\Merolapok motorsor\\Anker 1\\Merolapok\\","1902150249",2019,"2","15","02","49",null,2019,2,15,2,49,"Ejszaka","190215",19021400]
["Mérőlap_MSE4_A1_1902150443.pdf",".pdf","2019-07-18T07:26:23.774","2019-02-15T04:44:21.713","2019-07-18T07:26:23.507","U:\\Merolapok motorsor\\Anker 1\\Merolapok\\","1902150443",2019,"2","15","04","43",null,2019,2,15,4,43,"Ejszaka","190215",19021400]
["Mérőlap_MSE4_A1_1902151814.pdf",".pdf","2019-07-18T07:26:24.619","2019-02-15T18:15:32.895","2019-07-18T07:26:24.354","U:\\Merolapok motorsor\\Anker 1\\Merolapok\\","1902151814",2019,"2","15","18","14",null,2019,2,15,18,14,"Ejszaka","190215",19021500]
["Mérőlap_MSE4_A1_1902152029.pdf",".pdf","2019-07-18T07:26:25.466","2019-02-15T20:30:14.351","2019-07-18T07:26:25.228","U:\\Merolapok motorsor\\Anker 1\\Merolapok\\","1902152029",2019,"2","15","20","29",null,2019,2,15,20,29,"Ejszaka","190215",19021500]
["Mérőlap_MSE4_A1_1902152217.pdf",".pdf","2019-07-18T07:26:26.255","2019-02-15T22:18:09.870","2019-07-18T07:26:26.032","U:\\Merolapok motorsor\\Anker 1\\Merolapok\\","1902152217",2019,"2","15","22","17",null,2019,2,15,22,17,"Ejszaka","190215",19021500]
["Mérőlap_MSE4_A1_1902160036.pdf",".pdf","2019-07-18T07:26:27.677","2019-02-16T00:37:20.666","2019-07-18T07:26:27.265","U:\\Merolapok motorsor\\Anker 1\\Merolapok\\","1902160036",2019,"2","16","00","36",null,2019,2,16,0,36,"Ejszaka","190216",19021500]
["Mérőlap_MSE4_A1_1902160221.pdf",".pdf","2019-07-18T07:26:28.482","2019-02-16T02:22:21.981","2019-07-18T07:26:28.214","U:\\Merolapok motorsor\\Anker 1\\Merolapok\\","1902160221",2019,"2","16","02","21",null,2019,2,16,2,21,"Ejszaka","190216",19021500]
["Mérőlap_MSE4_A1_1902180636.pdf",".pdf","2019-07-18T07:26:29.400","2019-02-18T06:37:28.494","2019-07-18T07:26:29.115","U:\\Merolapok motorsor\\Anker 1\\Merolapok\\","1902180636",2019,"2","18","06","36",null,2019,2,18,6,36,"Nappal","190218",1902180]
["Mérőlap_MSE4_A1_1902180757.pdf",".pdf","2019-07-18T07:26:30.190","2019-02-18T07:58:08.996","2019-07-18T07:26:29.967","U:\\Merolapok motorsor\\Anker 1\\Merolapok\\","1902180757",2019,"2","18","07","57",null,2019,2,18,7,57,"Nappal","190218",1902180]
["Mérőlap_MSE4_A1_1902181250.pdf",".pdf","2019-07-18T07:26:31.085","2019-02-18T12:50:58.638","2019-07-18T07:26:30.726","U:\\Merolapok motorsor\\Anker 1\\Merolapok\\","1902181250",2019,"2","18","12","50",null,2019,2,18,12,50,"Nappal","190218",1902180]
["Mérőlap_MSE4_A1_1902181407.pdf",".pdf","2019-07-18T07:26:31.934","2019-02-18T14:08:08.356","2019-07-18T07:26:31.719","U:\\Merolapok motorsor\\Anker 1\\Merolapok\\","1902181407",2019,"2","18","14","07",null,2019,2,18,14,7,"Nappal","190218",1902180]
["Mérőlap_MSE4_A1_1902181613.pdf",".pdf","2019-07-18T07:26:32.842","2019-02-18T16:14:47.431","2019-07-18T07:26:32.563","U:\\Merolapok motorsor\\Anker 1\\Merolapok\\","1902181613",2019,"2","18","16","13",null,2019,2,18,16,13,"Nappal","190218",1902180]
["Mérőlap_MSE4_A1_1902221814.pdf",".pdf","2019-07-22T13:31:06.711","2019-02-22T18:15:49.684","2019-07-18T07:26:33.413","U:\\Merolapok motorsor\\Anker 1\\Merolapok\\","1902221814",2019,"2","22","18","14",null,2019,2,22,18,14,"Ejszaka","190222",19022200]
["Mérőlap_MSE4_A1_1902221957.pdf",".pdf","2019-07-18T07:26:34.570","2019-02-22T19:58:19.084","2019-07-18T07:26:34.270","U:\\Merolapok motorsor\\Anker 1\\Merolapok\\","1902221957",2019,"2","22","19","57",null,2019,2,22,19,57,"Ejszaka","190222",19022200]
["Mérőlap_MSE4_A1_1902222223.pdf",".pdf","2019-07-18T07:26:35.579","2019-02-22T22:24:10.895","2019-07-18T07:26:35.257","U:\\Merolapok motorsor\\Anker 1\\Merolapok\\","1902222223",2019,"2","22","22","23",null,2019,2,22,22,23,"Ejszaka","190222",19022200]
["Mérőlap_MSE4_A1_1902230157.pdf",".pdf","2019-07-18T07:26:36.691","2019-02-23T01:57:57.883","2019-07-18T07:26:36.196","U:\\Merolapok motorsor\\Anker 1\\Merolapok\\","1902230157",2019,"2","23","01","57",null,2019,2,23,1,57,"Ejszaka","190223",19022200]
["Mérőlap_MSE4_A1_1902231825.pdf",".pdf","2019-07-18T07:26:37.779","2019-02-23T18:26:04.978","2019-07-18T07:26:37.457","U:\\Merolapok motorsor\\Anker 1\\Merolapok\\","1902231825",2019,"2","23","18","25",null,2019,2,23,18,25,"Ejszaka","190223",19022300]
["Mérőlap_MSE4_A1_1902232013.pdf",".pdf","2019-07-18T07:26:39.360","2019-02-23T20:14:49.645","2019-07-18T07:26:38.991","U:\\Merolapok motorsor\\Anker 1\\Merolapok\\","1902232013",2019,"2","23","20","13",null,2019,2,23,20,13,"Ejszaka","190223",19022300]
["Mérőlap_MSE4_A1_1902232204.pdf",".pdf","2019-07-18T07:26:40.283","2019-02-23T22:05:00.263","2019-07-18T07:26:39.924","U:\\Merolapok motorsor\\Anker 1\\Merolapok\\","1902232204",2019,"2","23","22","04",null,2019,2,23,22,4,"Ejszaka","190223",19022300]
["Mérőlap_MSE4_A1_1902240250.pdf",".pdf","2019-07-18T07:26:41.205","2019-02-24T02:51:42.928","2019-07-18T07:26:40.913","U:\\Merolapok motorsor\\Anker 1\\Merolapok\\","1902240250",2019,"2","24","02","50",null,2019,2,24,2,50,"Ejszaka","190224",19022300]
["Mérőlap_MSE4_A1_1902260628.pdf",".pdf","2019-07-18T07:26:41.999","2019-02-26T06:29:27.793","2019-07-18T07:26:41.680","U:\\Merolapok motorsor\\Anker 1\\Merolapok\\","1902260628",2019,"2","26","06","28",null,2019,2,26,6,28,"Nappal","190226",1902260]
["Mérőlap_MSE4_A1_1902260819.pdf",".pdf","2019-07-18T07:26:42.739","2019-02-26T08:21:23.606","2019-07-18T07:26:42.480","U:\\Merolapok motorsor\\Anker 1\\Merolapok\\","1902260819",2019,"2","26","08","19",null,2019,2,26,8,19,"Nappal","190226",1902260]
["Mérőlap_MSE4_A1_1902261020.pdf",".pdf","2019-07-18T07:26:43.480","2019-02-26T10:20:58.333","2019-07-18T07:26:43.248","U:\\Merolapok motorsor\\Anker 1\\Merolapok\\","1902261020",2019,"2","26","10","20",null,2019,2,26,10,20,"Nappal","190226",1902260]
["Mérőlap_MSE4_A1_1902261243.pdf",".pdf","2019-07-18T07:26:44.254","2019-02-26T12:44:15.832","2019-07-18T07:26:43.970","U:\\Merolapok motorsor\\Anker 1\\Merolapok\\","1902261243",2019,"2","26","12","43",null,2019,2,26,12,43,"Nappal","190226",1902260]
["Mérőlap_MSE4_A1_1902270617.pdf",".pdf","2019-07-18T07:26:45.174","2019-02-27T06:18:16.547","2019-07-18T07:26:44.860","U:\\Merolapok motorsor\\Anker 1\\Merolapok\\","1902270617",2019,"2","27","06","17",null,2019,2,27,6,17,"Nappal","190227",1902270]
["Mérőlap_MSE4_A1_1902270859.pdf",".pdf","2019-07-18T07:26:46.337","2019-02-27T09:00:59.303","2019-07-18T07:26:46.016","U:\\Merolapok motorsor\\Anker 1\\Merolapok\\","1902270859",2019,"2","27","08","59",null,2019,2,27,8,59,"Nappal","190227",1902270]
["Mérőlap_MSE4_A1_1902271247.pdf",".pdf","2019-07-18T07:26:47.282","2019-02-27T12:51:00.758","2019-07-18T07:26:46.988","U:\\Merolapok motorsor\\Anker 1\\Merolapok\\","1902271247",2019,"2","27","12","47",null,2019,2,27,12,47,"Nappal","190227",1902270]
["Mérőlap_MSE4_A1_1902271443.pdf",".pdf","2019-07-18T07:26:48.194","2019-02-27T14:44:57.152","2019-07-18T07:26:47.816","U:\\Merolapok motorsor\\Anker 1\\Merolapok\\","1902271443",2019,"2","27","14","43",null,2019,2,27,14,43,"Nappal","190227",1902270]
["Mérőlap_MSE4_A1_1903021833.pdf",".pdf","2019-07-18T07:26:49.231","2019-03-02T18:34:16.145","2019-07-18T07:26:48.843","U:\\Merolapok motorsor\\Anker 1\\Merolapok\\","1903021833",2019,{"$f":"MID(G66,4,1)","v":"3"},{"$f":"MID(G66,5,2)","v":"02"},{"$f":"MID(G66,7,2)","v":"18"},{"$f":"MID(G66,9,2)","v":"33"},null,2019,3,2,18,33,"Ejszaka",{"$f":"MID(G66,1,6)","v":"190302"},19030200]
["Mérőlap_MSE4_A1_1903022032.pdf",".pdf","2019-07-18T07:26:50.156","2019-03-02T20:33:51.995","2019-07-18T07:26:49.928","U:\\Merolapok motorsor\\Anker 1\\Merolapok\\",{"$f":"MID(A67,17,10)","v":"1903022032"},2019,"3","02","20","32",null,2019,3,2,20,32,{"$f":"IF(Q67<6,\"Ejszaka\",IF(Q67<18,\"Nappal\",\"Ejszaka\"))","v":"Ejszaka"},"190302",{"$f":"IF(S67=\"Nappal\",T67*10,IF(Q67<6,T67*100-100,T67*100))","v":19030200}]
["Mérőlap_MSE4_A1_1903022212.pdf",".pdf","2019-07-18T07:26:51.146","2019-03-02T22:13:47.793","2019-07-18T07:26:50.838","U:\\Merolapok motorsor\\Anker 1\\Merolapok\\","1903022212",2019,"3","02","22","12",null,2019,3,2,22,12,"Ejszaka","190302",19030200]
["Mérőlap_MSE4_A1_1903030044.pdf",".pdf","2019-07-18T07:26:52.160","2019-03-03T00:45:40.227","2019-07-18T07:26:51.786","U:\\Merolapok motorsor\\Anker 1\\Merolapok\\","1903030044",2019,"3","03","00","44",null,2019,3,3,0,44,"Ejszaka","190303",19030200]
["Mérőlap_MSE4_A1_1903030437.pdf",".pdf","2019-07-18T07:26:53.280","2019-03-03T04:38:15.260","2019-07-18T07:26:52.962","U:\\Merolapok motorsor\\Anker 1\\Merolapok\\","1903030437",2019,"3","03","04","37",null,2019,3,3,4,37,"Ejszaka","190303",19030200]
["Mérőlap_MSE4_A1_1903031818.pdf",".pdf","2019-07-18T07:26:54.270","2019-03-03T18:19:17.617","2019-07-18T07:26:54.002","U:\\Merolapok motorsor\\Anker 1\\Merolapok\\","1903031818",2019,"3","03","18","18",null,2019,3,3,18,18,"Ejszaka","190303",19030300]
["Mérőlap_MSE4_A1_1903032139.pdf",".pdf","2019-07-18T07:26:55.311","2019-03-03T21:40:13.960","2019-07-18T07:26:55.037","U:\\Merolapok motorsor\\Anker 1\\Merolapok\\","1903032139",2019,"3","03","21","39",null,2019,3,3,21,39,"Ejszaka","190303",19030300]
["Mérőlap_MSE4_A1_1903040415.pdf",".pdf","2019-07-18T07:26:56.266","2019-03-04T04:16:40.401","2019-07-18T07:26:55.957","U:\\Merolapok motorsor\\Anker 1\\Merolapok\\","1903040415",2019,"3","04","04","15",null,2019,3,4,4,15,"Ejszaka","190304",19030300]
["Mérőlap_MSE4_A1_1903060624.pdf",".pdf","2019-07-18T07:26:57.388","2019-03-06T06:25:23.835","2019-07-18T07:26:57.121","U:\\Merolapok motorsor\\Anker 1\\Merolapok\\","1903060624",2019,"3","06","06","24",null,2019,3,6,6,24,"Nappal","190306",1903060]
["Mérőlap_MSE4_A1_1903060821.pdf",".pdf","2019-07-18T07:26:58.311","2019-03-06T08:22:27.392","2019-07-18T07:26:58.067","U:\\Merolapok motorsor\\Anker 1\\Merolapok\\","1903060821",2019,"3","06","08","21",null,2019,3,6,8,21,"Nappal","190306",1903060]
["Mérőlap_MSE4_A1_1903061024.pdf",".pdf","2019-07-18T07:26:59.337","2019-03-06T10:25:31.060","2019-07-18T07:26:58.998","U:\\Merolapok motorsor\\Anker 1\\Merolapok\\","1903061024",2019,"3","06","10","24",null,2019,3,6,10,24,"Nappal","190306",1903060]
["Mérőlap_MSE4_A1_1903061213.pdf",".pdf","2019-07-18T07:27:00.294","2019-03-06T12:14:11.132","2019-07-18T07:26:59.920","U:\\Merolapok motorsor\\Anker 1\\Merolapok\\","1903061213",2019,"3","06","12","13",null,2019,3,6,12,13,"Nappal","190306",1903060]
["Mérőlap_MSE4_A1_1903061417.pdf",".pdf","2019-07-18T07:27:01.369","2019-03-06T14:18:38.211","2019-07-18T07:27:01.042","U:\\Merolapok motorsor\\Anker 1\\Merolapok\\","1903061417",2019,"3","06","14","17",null,2019,3,6,14,17,"Nappal","190306",1903060]
["Mérőlap_MSE4_A1_1903070751.pdf",".pdf","2019-07-18T07:27:02.458","2019-03-07T07:52:01.645","2019-07-18T07:27:02.161","U:\\Merolapok motorsor\\Anker 1\\Merolapok\\","1903070751",2019,"3","07","07","51",null,2019,3,7,7,51,"Nappal","190307",1903070]
["Mérőlap_MSE4_A1_1903070956.pdf",".pdf","2019-07-18T07:27:03.438","2019-03-07T09:57:25.422","2019-07-18T07:27:03.100","U:\\Merolapok motorsor\\Anker 1\\Merolapok\\","1903070956",2019,"3","07","09","56",null,2019,3,7,9,56,"Nappal","190307",1903070]
["Mérőlap_MSE4_A1_1903071207.pdf",".pdf","2019-07-18T07:27:04.509","2019-03-07T12:08:25.964","2019-07-18T07:27:04.174","U:\\Merolapok motorsor\\Anker 1\\Merolapok\\","1903071207",2019,"3","07","12","07",null,2019,3,7,12,7,"Nappal","190307",1903070]
["Mérőlap_MSE4_A1_1903101835.pdf",".pdf","2019-07-18T07:27:05.998","2019-03-10T18:37:43.636","2019-07-18T07:27:05.671","U:\\Merolapok motorsor\\Anker 1\\Merolapok\\","1903101835",2019,"3","10","18","35",null,2019,3,10,18,35,"Ejszaka","190310",19031000]
["Mérőlap_MSE4_A1_1903102034.pdf",".pdf","2019-07-18T07:27:06.982","2019-03-10T20:35:45.663","2019-07-18T07:27:06.673","U:\\Merolapok motorsor\\Anker 1\\Merolapok\\","1903102034",2019,"3","10","20","34",null,2019,3,10,20,34,"Ejszaka","190310",19031000]
["Mérőlap_MSE4_A1_1903102208.pdf",".pdf","2019-07-18T07:27:08.185","2019-03-10T22:09:01.596","2019-07-18T07:27:07.796","U:\\Merolapok motorsor\\Anker 1\\Merolapok\\","1903102208",2019,"3","10","22","08",null,2019,3,10,22,8,"Ejszaka","190310",19031000]
["Mérőlap_MSE4_A1_1903110050.pdf",".pdf","2019-07-18T07:27:09.217","2019-03-11T00:51:30.934","2019-07-18T07:27:08.892","U:\\Merolapok motorsor\\Anker 1\\Merolapok\\","1903110050",2019,"3","11","00","50",null,2019,3,11,0,50,"Ejszaka","190311",19031000]
["Mérőlap_MSE4_A1_1903110357.pdf",".pdf","2019-07-18T07:27:10.268","2019-03-11T03:58:12.809","2019-07-18T07:27:09.970","U:\\Merolapok motorsor\\Anker 1\\Merolapok\\","1903110357",2019,"3","11","03","57",null,2019,3,11,3,57,"Ejszaka","190311",19031000]
["Mérőlap_MSE4_A1_1903191831.pdf",".pdf","2019-07-18T07:27:11.235","2019-03-19T18:33:11.289","2019-07-18T07:27:10.884","U:\\Merolapok motorsor\\Anker 1\\Merolapok\\","1903191831",2019,"3","19","18","31",null,2019,3,19,18,31,"Ejszaka","190319",19031900]
["Mérőlap_MSE4_A1_1903192149.pdf",".pdf","2019-07-18T07:27:12.171","2019-03-19T21:50:12.044","2019-07-18T07:27:11.893","U:\\Merolapok motorsor\\Anker 1\\Merolapok\\","1903192149",2019,"3","19","21","49",null,2019,3,19,21,49,"Ejszaka","190319",19031900]
["Mérőlap_MSE4_A1_1903200215.pdf",".pdf","2019-07-18T07:27:13.205","2019-03-20T02:17:12.086","2019-07-18T07:27:12.922","U:\\Merolapok motorsor\\Anker 1\\Merolapok\\","1903200215",2019,"3","20","02","15",null,2019,3,20,2,15,"Ejszaka","190320",19031900]
["Mérőlap_MSE4_A1_1903200442.pdf",".pdf","2019-07-18T07:27:14.314","2019-03-20T04:43:14.477","2019-07-18T07:27:13.894","U:\\Merolapok motorsor\\Anker 1\\Merolapok\\","1903200442",2019,"3","20","04","42",null,2019,3,20,4,42,"Ejszaka","190320",19031900]
["Mérőlap_MSE4_A1_1903220633.pdf",".pdf","2019-07-18T07:27:15.358","2019-03-22T06:34:47.577","2019-07-18T07:27:15.042","U:\\Merolapok motorsor\\Anker 1\\Merolapok\\","1903220633",2019,"3","22","06","33",null,2019,3,22,6,33,"Nappal","190322",1903220]
["Mérőlap_MSE4_A1_1903220905.pdf",".pdf","2019-07-18T07:27:16.262","2019-03-22T09:06:30.333","2019-07-18T07:27:15.986","U:\\Merolapok motorsor\\Anker 1\\Merolapok\\","1903220905",2019,"3","22","09","05",null,2019,3,22,9,5,"Nappal","190322",1903220]
["Mérőlap_MSE4_A1_1903221031.pdf",".pdf","2019-07-18T07:27:17.133","2019-03-22T10:32:16.759","2019-07-18T07:27:16.886","U:\\Merolapok motorsor\\Anker 1\\Merolapok\\","1903221031",2019,"3","22","10","31",null,2019,3,22,10,31,"Nappal","190322",1903220]
["Mérőlap_MSE4_A1_1903221421.pdf",".pdf","2019-07-18T07:27:18.013","2019-03-22T14:22:27.251","2019-07-18T07:27:17.779","U:\\Merolapok motorsor\\Anker 1\\Merolapok\\","1903221421",2019,"3","22","14","21",null,2019,3,22,14,21,"Nappal","190322",1903220]
["Mérőlap_MSE4_A1_1903261940.pdf",".pdf","2019-07-18T07:27:18.858","2019-03-26T19:42:34.292","2019-07-18T07:27:18.610","U:\\Merolapok motorsor\\Anker 1\\Merolapok\\","1903261940",2019,"3","26","19","40",null,2019,3,26,19,40,"Ejszaka","190326",19032600]
["Mérőlap_MSE4_A1_1903262158.pdf",".pdf","2019-07-18T07:27:19.753","2019-03-26T21:59:39.417","2019-07-18T07:27:19.508","U:\\Merolapok motorsor\\Anker 1\\Merolapok\\","1903262158",2019,"3","26","21","58",null,2019,3,26,21,58,"Ejszaka","190326",19032600]
["Mérőlap_MSE4_A1_1903270038.pdf",".pdf","2019-07-18T07:27:20.657","2019-03-27T00:38:57.973","2019-07-18T07:27:20.317","U:\\Merolapok motorsor\\Anker 1\\Merolapok\\","1903270038",2019,"3","27","00","38",null,2019,3,27,0,38,"Ejszaka","190327",19032600]
["Mérőlap_MSE4_A1_1903270207.pdf",".pdf","2019-07-18T07:27:21.548","2019-03-27T02:08:08.914","2019-07-18T07:27:21.261","U:\\Merolapok motorsor\\Anker 1\\Merolapok\\","1903270207",2019,"3","27","02","07",null,2019,3,27,2,7,"Ejszaka","190327",19032600]
["Mérőlap_MSE4_A1_1903300643.pdf",".pdf","2019-07-18T07:27:22.535","2019-03-30T06:44:17.762","2019-07-18T07:27:22.235","U:\\Merolapok motorsor\\Anker 1\\Merolapok\\","1903300643",2019,"3","30","06","43",null,2019,3,30,6,43,"Nappal","190330",1903300]
["Mérőlap_MSE4_A1_1903300833.pdf",".pdf","2019-07-18T07:27:23.934","2019-03-30T08:35:42.099","2019-07-18T07:27:23.536","U:\\Merolapok motorsor\\Anker 1\\Merolapok\\","1903300833",2019,"3","30","08","33",null,2019,3,30,8,33,"Nappal","190330",1903300]
["Mérőlap_MSE4_A1_1904031828.pdf",".pdf","2019-07-18T07:27:24.926","2019-04-03T18:29:38.358","2019-07-18T07:27:24.538","U:\\Merolapok motorsor\\Anker 1\\Merolapok\\","1904031828",2019,"4","03","18","28",null,2019,4,3,18,28,"Ejszaka","190403",19040300]
["Mérőlap_MSE4_A1_1904032000.pdf",".pdf","2019-07-18T07:27:25.852","2019-04-03T20:01:11.667","2019-07-18T07:27:25.512","U:\\Merolapok motorsor\\Anker 1\\Merolapok\\","1904032000",2019,"4","03","20","00",null,2019,4,3,20,0,"Ejszaka","190403",19040300]
["Mérőlap_MSE4_A1_1904032228.pdf",".pdf","2019-07-18T07:27:26.871","2019-04-03T22:29:48.792","2019-07-18T07:27:26.531","U:\\Merolapok motorsor\\Anker 1\\Merolapok\\","1904032228",2019,"4","03","22","28",null,2019,4,3,22,28,"Ejszaka","190403",19040300]
["Mérőlap_MSE4_A1_1904040224.pdf",".pdf","2019-07-18T07:27:27.750","2019-04-04T02:24:59.592","2019-07-18T07:27:27.453","U:\\Merolapok motorsor\\Anker 1\\Merolapok\\","1904040224",2019,"4","04","02","24",null,2019,4,4,2,24,"Ejszaka","190404",19040300]
["Mérőlap_MSE4_A1_1904040429.pdf",".pdf","2019-07-18T07:27:28.634","2019-04-04T04:30:29.246","2019-07-18T07:27:28.360","U:\\Merolapok motorsor\\Anker 1\\Merolapok\\","1904040429",2019,"4","04","04","29",null,2019,4,4,4,29,"Ejszaka","190404",19040300]
["Mérőlap_MSE4_A1_1904070623.pdf",".pdf","2019-07-18T07:27:29.788","2019-04-07T06:24:10.753","2019-07-18T07:27:29.470","U:\\Merolapok motorsor\\Anker 1\\Merolapok\\","1904070623",2019,"4","07","06","23",null,2019,4,7,6,23,"Nappal","190407",1904070]
["Mérőlap_MSE4_A1_1904070801.pdf",".pdf","2019-07-18T07:27:30.664","2019-04-07T08:02:22.831","2019-07-18T07:27:30.395","U:\\Merolapok motorsor\\Anker 1\\Merolapok\\","1904070801",2019,"4","07","08","01",null,2019,4,7,8,1,"Nappal","190407",1904070]
["Mérőlap_MSE4_A1_1904070951.pdf",".pdf","2019-07-18T07:27:31.601","2019-04-07T09:52:11.432","2019-07-18T07:27:31.255","U:\\Merolapok motorsor\\Anker 1\\Merolapok\\","1904070951",2019,"4","07","09","51",null,2019,4,7,9,51,"Nappal","190407",1904070]
["Mérőlap_MSE4_A1_1904071232.pdf",".pdf","2019-07-18T07:27:32.527","2019-04-07T12:33:45.126","2019-07-18T07:27:32.238","U:\\Merolapok motorsor\\Anker 1\\Merolapok\\","1904071232",2019,"4","07","12","32",null,2019,4,7,12,32,"Nappal","190407",1904070]
["Mérőlap_MSE4_A1_1904071425.pdf",".pdf","2019-07-18T07:27:33.421","2019-04-07T14:26:12.508","2019-07-18T07:27:33.156","U:\\Merolapok motorsor\\Anker 1\\Merolapok\\","1904071425",2019,"4","07","14","25",null,2019,4,7,14,25,"Nappal","190407",1904070]
["Mérőlap_MSE4_A1_1904071623.pdf",".pdf","2019-07-18T07:27:34.271","2019-04-07T16:24:45.799","2019-07-18T07:27:33.968","U:\\Merolapok motorsor\\Anker 1\\Merolapok\\","1904071623",2019,"4","07","16","23",null,2019,4,7,16,23,"Nappal","190407",1904070]
["Mérőlap_MSE4_A1_1904080802.pdf",".pdf","2019-07-18T07:27:35.156","2019-04-08T08:03:36.477","2019-07-18T07:27:34.873","U:\\Merolapok motorsor\\Anker 1\\Merolapok\\","1904080802",2019,"4","08","08","02",null,2019,4,8,8,2,"Nappal","190408",1904080]
["Mérőlap_MSE4_A1_1904081010.pdf",".pdf","2019-07-18T07:27:36.135","2019-04-08T10:11:23.665","2019-07-18T07:27:35.768","U:\\Merolapok motorsor\\Anker 1\\Merolapok\\","1904081010",2019,"4","08","10","10",null,2019,4,8,10,10,"Nappal","190408",1904080]
["Mérőlap_MSE4_A1_1904081207.pdf",".pdf","2019-07-18T07:27:37.021","2019-04-08T12:11:36.694","2019-07-18T07:27:36.768","U:\\Merolapok motorsor\\Anker 1\\Merolapok\\","1904081207",2019,"4","08","12","07",null,2019,4,8,12,7,"Nappal","190408",1904080]
["Mérőlap_MSE4_A1_1904081615.pdf",".pdf","2019-07-18T07:27:38.008","2019-04-08T16:16:36.555","2019-07-18T07:27:37.645","U:\\Merolapok motorsor\\Anker 1\\Merolapok\\","1904081615",2019,"4","08","16","15",null,2019,4,8,16,15,"Nappal","190408",1904080]
["Mérőlap_MSE4_A1_1904121855.pdf",".pdf","2019-07-18T07:27:39.058","2019-04-12T18:56:19.742","2019-07-18T07:27:38.751","U:\\Merolapok motorsor\\Anker 1\\Merolapok\\","1904121855",2019,"4","12","18","55",null,2019,4,12,18,55,"Ejszaka","190412",19041200]
["Mérőlap_MSE4_A1_1904122037.pdf",".pdf","2019-07-18T07:27:40.087","2019-04-12T20:38:58.426","2019-07-18T07:27:39.777","U:\\Merolapok motorsor\\Anker 1\\Merolapok\\","1904122037",2019,"4","12","20","37",null,2019,4,12,20,37,"Ejszaka","190412",19041200]
["Mérőlap_MSE4_A1_1904130215.pdf",".pdf","2019-07-18T07:27:41.616","2019-04-13T02:16:35.962","2019-07-18T07:27:41.183","U:\\Merolapok motorsor\\Anker 1\\Merolapok\\","1904130215",2019,"4","13","02","15",null,2019,4,13,2,15,"Ejszaka","190413",19041200]
["Mérőlap_MSE4_A1_1904130359.pdf",".pdf","2019-07-18T07:27:42.826","2019-04-13T04:00:22.469","2019-07-18T07:27:42.318","U:\\Merolapok motorsor\\Anker 1\\Merolapok\\","1904130359",2019,"4","13","03","59",null,2019,4,13,3,59,"Ejszaka","190413",19041200]
["Mérőlap_MSE4_A1_1904150625.pdf",".pdf","2019-07-18T07:27:44.365","2019-04-15T06:26:31.643","2019-07-18T07:27:43.351","U:\\Merolapok motorsor\\Anker 1\\Merolapok\\","1904150625",2019,"4","15","06","25",null,2019,4,15,6,25,"Nappal","190415",1904150]
["Mérőlap_MSE4_A1_1904151001.pdf",".pdf","2019-07-18T07:27:47.553","2019-04-15T10:02:40.796","2019-07-18T07:27:45.636","U:\\Merolapok motorsor\\Anker 1\\Merolapok\\","1904151001",2019,"4","15","10","01",null,2019,4,15,10,1,"Nappal","190415",1904150]
["Mérőlap_MSE4_A1_1904151615.pdf",".pdf","2019-07-18T07:27:49.107","2019-04-15T16:16:33.513","2019-07-18T07:27:48.791","U:\\Merolapok motorsor\\Anker 1\\Merolapok\\","1904151615",2019,"4","15","16","15",null,2019,4,15,16,15,"Nappal","190415",1904150]
["Mérőlap_MSE4_A1_1904161513.pdf",".pdf","2019-07-18T07:27:50.122","2019-04-16T15:13:02.044","2019-07-18T07:27:49.904","U:\\Merolapok motorsor\\Anker 1\\Merolapok\\","1904161513",2019,"4","16","15","13",null,2019,4,16,15,13,"Nappal","190416",1904160]
["Mérőlap_MSE4_A1_1904230742.pdf",".pdf","2019-07-18T07:27:51.931","2019-04-23T07:44:04.860","2019-07-18T07:27:51.602","U:\\Merolapok motorsor\\Anker 1\\Merolapok\\","1904230742",2019,"4","23","07","42",null,2019,4,23,7,42,"Nappal","190423",1904230]
["Mérőlap_MSE4_A1_1904231417.pdf",".pdf","2019-07-18T07:27:53.221","2019-04-23T14:17:53.926","2019-07-18T07:27:53.045","U:\\Merolapok motorsor\\Anker 1\\Merolapok\\","1904231417",2019,"4","23","14","17",null,2019,4,23,14,17,"Nappal","190423",1904230]
["Mérőlap_MSE4_A1_1904231644.pdf",".pdf","2019-07-18T07:27:53.999","2019-04-23T16:48:24.226","2019-07-18T07:27:53.754","U:\\Merolapok motorsor\\Anker 1\\Merolapok\\","1904231644",2019,"4","23","16","44",null,2019,4,23,16,44,"Nappal","190423",1904230]
["Mérőlap_MSE4_A1_1904240631.pdf",".pdf","2019-07-18T07:27:54.956","2019-04-24T06:32:57.121","2019-07-18T07:27:54.620","U:\\Merolapok motorsor\\Anker 1\\Merolapok\\","1904240631",2019,"4","24","06","31",null,2019,4,24,6,31,"Nappal","190424",1904240]
["Mérőlap_MSE4_A1_1904240839.pdf",".pdf","2019-07-18T07:27:55.943","2019-04-24T08:40:17.497","2019-07-18T07:27:55.557","U:\\Merolapok motorsor\\Anker 1\\Merolapok\\","1904240839",2019,"4","24","08","39",null,2019,4,24,8,39,"Nappal","190424",1904240]
["Mérőlap_MSE4_A1_1904241220.pdf",".pdf","2019-07-18T07:27:56.947","2019-04-24T12:21:46.322","2019-07-18T07:27:56.715","U:\\Merolapok motorsor\\Anker 1\\Merolapok\\","1904241220",2019,"4","24","12","20",null,2019,4,24,12,20,"Nappal","190424",1904240]
["Mérőlap_MSE4_A1_1904241438.pdf",".pdf","2019-07-18T07:27:57.825","2019-04-24T14:39:55.943","2019-07-18T07:27:57.582","U:\\Merolapok motorsor\\Anker 1\\Merolapok\\","1904241438",2019,{"$f":"MID(G130,4,1)","v":"4"},{"$f":"MID(G130,5,2)","v":"24"},{"$f":"MID(G130,7,2)","v":"14"},{"$f":"MID(G130,9,2)","v":"38"},null,2019,4,24,14,38,"Nappal",{"$f":"MID(G130,1,6)","v":"190424"},1904240]
["Mérőlap_MSE4_A1_1904271824.pdf",".pdf","2019-07-18T07:27:58.892","2019-04-27T18:25:22.533","2019-07-18T07:27:58.579","U:\\Merolapok motorsor\\Anker 1\\Merolapok\\",{"$f":"MID(A131,17,10)","v":"1904271824"},2019,"4","27","18","24",null,2019,4,27,18,24,{"$f":"IF(Q131<6,\"Ejszaka\",IF(Q131<18,\"Nappal\",\"Ejszaka\"))","v":"Ejszaka"},"190427",{"$f":"IF(S131=\"Nappal\",T131*10,IF(Q131<6,T131*100-100,T131*100))","v":19042700}]
["Mérőlap_MSE4_A1_1904272137.pdf",".pdf","2019-07-18T07:28:00.069","2019-04-27T21:38:30.841","2019-07-18T07:27:59.754","U:\\Merolapok motorsor\\Anker 1\\Merolapok\\","1904272137",2019,"4","27","21","37",null,2019,4,27,21,37,"Ejszaka","190427",19042700]
["Mérőlap_MSE4_A1_1904280030.pdf",".pdf","2019-07-18T07:28:01.261","2019-04-28T00:31:48.582","2019-07-18T07:28:00.861","U:\\Merolapok motorsor\\Anker 1\\Merolapok\\","1904280030",2019,"4","28","00","30",null,2019,4,28,0,30,"Ejszaka","190428",19042700]
["Mérőlap_MSE4_A1_1904280240.pdf",".pdf","2019-07-18T07:28:02.383","2019-04-28T02:41:56.227","2019-07-18T07:28:02.054","U:\\Merolapok motorsor\\Anker 1\\Merolapok\\","1904280240",2019,"4","28","02","40",null,2019,4,28,2,40,"Ejszaka","190428",19042700]
["Mérőlap_MSE4_A1_1904281829.pdf",".pdf","2019-07-18T07:28:03.277","2019-04-28T18:30:34.946","2019-07-18T07:28:02.990","U:\\Merolapok motorsor\\Anker 1\\Merolapok\\","1904281829",2019,"4","28","18","29",null,2019,4,28,18,29,"Ejszaka","190428",19042800]
["Mérőlap_MSE4_A1_1904282009.pdf",".pdf","2019-07-18T07:28:04.136","2019-04-28T20:10:42.134","2019-07-18T07:28:03.851","U:\\Merolapok motorsor\\Anker 1\\Merolapok\\","1904282009",2019,"4","28","20","09",null,2019,4,28,20,9,"Ejszaka","190428",19042800]
["Mérőlap_MSE4_A1_1904282141.pdf",".pdf","2019-07-18T07:28:05.344","2019-04-28T21:43:10.239","2019-07-18T07:28:04.734","U:\\Merolapok motorsor\\Anker 1\\Merolapok\\","1904282141",2019,"4","28","21","41",null,2019,4,28,21,41,"Ejszaka","190428",19042800]
["Mérőlap_MSE4_A1_1904290047.pdf",".pdf","2019-07-18T07:28:06.220","2019-04-29T00:48:19.883","2019-07-18T07:28:05.945","U:\\Merolapok motorsor\\Anker 1\\Merolapok\\","1904290047",2019,"4","29","00","47",null,2019,4,29,0,47,"Ejszaka","190429",19042800]
["Mérőlap_MSE4_A1_1904290443.pdf",".pdf","2019-07-18T07:28:07.090","2019-04-29T04:44:00.599","2019-07-18T07:28:06.813","U:\\Merolapok motorsor\\Anker 1\\Merolapok\\","1904290443",2019,"4","29","04","43",null,2019,4,29,4,43,"Ejszaka","190429",19042800]
["Mérőlap_MSE4_A1_1905020625.pdf",".pdf","2019-07-18T07:28:08.670","2019-05-02T06:26:40.754","2019-07-18T07:28:08.344","U:\\Merolapok motorsor\\Anker 1\\Merolapok\\","1905020625",2019,"5","02","06","25",null,2019,5,2,6,25,"Nappal","190502",1905020]
["Mérőlap_MSE4_A1_1905020806.pdf",".pdf","2019-07-18T07:28:09.671","2019-05-02T08:08:23.318","2019-07-18T07:28:09.320","U:\\Merolapok motorsor\\Anker 1\\Merolapok\\","1905020806",2019,"5","02","08","06",null,2019,5,2,8,6,"Nappal","190502",1905020]
["Mérőlap_MSE4_A1_1905020951.pdf",".pdf","2019-07-18T07:28:11.290","2019-05-02T09:52:02.949","2019-07-18T07:28:10.365","U:\\Merolapok motorsor\\Anker 1\\Merolapok\\","1905020951",2019,"5","02","09","51",null,2019,5,2,9,51,"Nappal","190502",1905020]
["Mérőlap_MSE4_A1_1905021549.pdf",".pdf","2019-07-18T07:28:12.664","2019-05-02T15:50:17.390","2019-07-18T07:28:12.348","U:\\Merolapok motorsor\\Anker 1\\Merolapok\\","1905021549",2019,"5","02","15","49",null,2019,5,2,15,49,"Nappal","190502",1905020]
["Mérőlap_MSE4_A1_1905061823.pdf",".pdf","2019-07-18T07:28:13.788","2019-05-06T18:24:52.520","2019-07-18T07:28:13.482","U:\\Merolapok motorsor\\Anker 1\\Merolapok\\","1905061823",2019,"5","06","18","23",null,2019,5,6,18,23,"Ejszaka","190506",19050600]
["Mérőlap_MSE4_A1_1905062000.pdf",".pdf","2019-07-18T07:28:14.827","2019-05-06T20:01:06.796","2019-07-18T07:28:14.550","U:\\Merolapok motorsor\\Anker 1\\Merolapok\\","1905062000",2019,"5","06","20","00",null,2019,5,6,20,0,"Ejszaka","190506",19050600]
["Mérőlap_MSE4_A1_1905062213.pdf",".pdf","2019-07-18T07:28:15.950","2019-05-06T22:14:43.782","2019-07-18T07:28:15.590","U:\\Merolapok motorsor\\Anker 1\\Merolapok\\","1905062213",2019,"5","06","22","13",null,2019,5,6,22,13,"Ejszaka","190506",19050600]
["Mérőlap_MSE4_A1_1905070218.pdf",".pdf","2019-07-18T07:28:18.426","2019-05-07T02:19:41.486","2019-07-18T07:28:18.145","U:\\Merolapok motorsor\\Anker 1\\Merolapok\\","1905070218",2019,"5","07","02","18",null,2019,5,7,2,18,"Ejszaka","190507",19050600]
["Mérőlap_MSE4_A1_1905070344.pdf",".pdf","2019-07-18T07:28:19.582","2019-05-07T03:45:50.205","2019-07-18T07:28:19.262","U:\\Merolapok motorsor\\Anker 1\\Merolapok\\","1905070344",2019,"5","07","03","44",null,2019,5,7,3,44,"Ejszaka","190507",19050600]
["Mérőlap_MSE4_A1_1905090756.pdf",".pdf","2019-07-18T07:28:21.064","2019-05-09T07:57:00.643","2019-07-18T07:28:20.592","U:\\Merolapok motorsor\\Anker 1\\Merolapok\\","1905090756",2019,"5","09","07","56",null,2019,5,9,7,56,"Nappal","190509",1905090]
["Mérőlap_MSE4_A1_1905090949.pdf",".pdf","2019-07-18T07:28:22.078","2019-05-09T09:50:16.159","2019-07-18T07:28:21.811","U:\\Merolapok motorsor\\Anker 1\\Merolapok\\","1905090949",2019,"5","09","09","49",null,2019,5,9,9,49,"Nappal","190509",1905090]
["Mérőlap_MSE4_A1_1905091144.pdf",".pdf","2019-07-18T07:28:23.106","2019-05-09T11:45:46.224","2019-07-18T07:28:22.830","U:\\Merolapok motorsor\\Anker 1\\Merolapok\\","1905091144",2019,"5","09","11","44",null,2019,5,9,11,44,"Nappal","190509",1905090]
["Mérőlap_MSE4_A1_1905091355.pdf",".pdf","2019-07-18T07:28:24.364","2019-05-09T13:56:52.589","2019-07-18T07:28:24.013","U:\\Merolapok motorsor\\Anker 1\\Merolapok\\","1905091355",2019,"5","09","13","55",null,2019,5,9,13,55,"Nappal","190509",1905090]
["Mérőlap_MSE4_A1_1905091558.pdf",".pdf","2019-07-18T07:28:25.331","2019-05-09T15:59:59.432","2019-07-18T07:28:25.072","U:\\Merolapok motorsor\\Anker 1\\Merolapok\\","1905091558",2019,"5","09","15","58",null,2019,5,9,15,58,"Nappal","190509",1905090]
["Mérőlap_MSE4_A1_1905110626.pdf",".pdf","2019-07-18T07:28:26.499","2019-05-11T06:27:44.816","2019-07-18T07:28:26.098","U:\\Merolapok motorsor\\Anker 1\\Merolapok\\","1905110626",2019,"5","11","06","26",null,2019,5,11,6,26,"Nappal","190511",1905110]
["Mérőlap_MSE4_A1_1905110833.pdf",".pdf","2019-07-18T07:28:27.646","2019-05-11T08:34:10.848","2019-07-18T07:28:27.243","U:\\Merolapok motorsor\\Anker 1\\Merolapok\\","1905110833",2019,"5","11","08","33",null,2019,5,11,8,33,"Nappal","190511",1905110]
["Mérőlap_MSE4_A1_1905111006.pdf",".pdf","2019-07-18T07:28:28.591","2019-05-11T10:07:58.741","2019-07-18T07:28:28.324","U:\\Merolapok motorsor\\Anker 1\\Merolapok\\","1905111006",2019,"5","11","10","06",null,2019,5,11,10,6,"Nappal","190511",1905110]
["Mérőlap_MSE4_A1_1905111416.pdf",".pdf","2019-07-18T07:28:30.459","2019-05-11T14:18:10.147","2019-07-18T07:28:29.480","U:\\Merolapok motorsor\\Anker 1\\Merolapok\\","1905111416",2019,"5","11","14","16",null,2019,5,11,14,16,"Nappal","190511",1905110]
["Mérőlap_MSE4_A1_1905111626.pdf",".pdf","2019-07-18T07:28:31.555","2019-05-11T16:28:02.789","2019-07-18T07:28:31.228","U:\\Merolapok motorsor\\Anker 1\\Merolapok\\","1905111626",2019,"5","11","16","26",null,2019,5,11,16,26,"Nappal","190511",1905110]
["Mérőlap_MSE4_A1_1905131838.pdf",".pdf","2019-07-18T07:28:32.693","2019-05-13T18:39:08.880","2019-07-18T07:28:32.249","U:\\Merolapok motorsor\\Anker 1\\Merolapok\\","1905131838",2019,"5","13","18","38",null,2019,5,13,18,38,"Ejszaka","190513",19051300]
["Mérőlap_MSE4_A1_1905132223.pdf",".pdf","2019-07-18T07:28:33.731","2019-05-13T22:24:36.972","2019-07-18T07:28:33.376","U:\\Merolapok motorsor\\Anker 1\\Merolapok\\","1905132223",2019,"5","13","22","23",null,2019,5,13,22,23,"Ejszaka","190513",19051300]
["Mérőlap_MSE4_A1_1905140022.pdf",".pdf","2019-07-18T07:28:34.865","2019-05-14T00:23:28.920","2019-07-18T07:28:34.402","U:\\Merolapok motorsor\\Anker 1\\Merolapok\\","1905140022",2019,"5","14","00","22",null,2019,5,14,0,22,"Ejszaka","190514",19051300]
["Mérőlap_MSE4_A1_1905140233.pdf",".pdf","2019-07-18T07:28:36.086","2019-05-14T02:34:39.358","2019-07-18T07:28:35.696","U:\\Merolapok motorsor\\Anker 1\\Merolapok\\","1905140233",2019,"5","14","02","33",null,2019,5,14,2,33,"Ejszaka","190514",19051300]
["Mérőlap_MSE4_A1_1905170616.pdf",".pdf","2019-07-18T07:28:37.004","2019-05-17T06:17:41.734","2019-07-18T07:28:36.651","U:\\Merolapok motorsor\\Anker 1\\Merolapok\\","1905170616",2019,"5","17","06","16",null,2019,5,17,6,16,"Nappal","190517",1905170]
["Mérőlap_MSE4_A1_1905170803.pdf",".pdf","2019-07-18T07:28:38.058","2019-05-17T08:04:19.569","2019-07-18T07:28:37.613","U:\\Merolapok motorsor\\Anker 1\\Merolapok\\","1905170803",2019,"5","17","08","03",null,2019,5,17,8,3,"Nappal","190517",1905170]
["Mérőlap_MSE4_A1_1905171023.pdf",".pdf","2019-07-18T07:28:38.862","2019-05-17T10:24:04.312","2019-07-18T07:28:38.592","U:\\Merolapok motorsor\\Anker 1\\Merolapok\\","1905171023",2019,"5","17","10","23",null,2019,5,17,10,23,"Nappal","190517",1905170]
["Mérőlap_MSE4_A1_1905171153.pdf",".pdf","2019-07-18T07:28:39.680","2019-05-17T11:54:14.243","2019-07-18T07:28:39.385","U:\\Merolapok motorsor\\Anker 1\\Merolapok\\","1905171153",2019,"5","17","11","53",null,2019,5,17,11,53,"Nappal","190517",1905170]
["Mérőlap_MSE4_A1_1905171547.pdf",".pdf","2019-07-18T07:28:41.270","2019-05-17T15:48:42.052","2019-07-18T07:28:40.210","U:\\Merolapok motorsor\\Anker 1\\Merolapok\\","1905171547",2019,"5","17","15","47",null,2019,5,17,15,47,"Nappal","190517",1905170]
["Mérőlap_MSE4_A1_1905180614.pdf",".pdf","2019-07-18T07:28:42.688","2019-05-18T06:15:34.974","2019-07-18T07:28:42.316","U:\\Merolapok motorsor\\Anker 1\\Merolapok\\","1905180614",2019,"5","18","06","14",null,2019,5,18,6,14,"Nappal","190518",1905180]
["Mérőlap_MSE4_A1_1905180800.pdf",".pdf","2019-07-18T07:28:43.526","2019-05-18T08:01:55.429","2019-07-18T07:28:43.309","U:\\Merolapok motorsor\\Anker 1\\Merolapok\\","1905180800",2019,"5","18","08","00",null,2019,5,18,8,0,"Nappal","190518",1905180]
["Mérőlap_MSE4_A1_1905181341.pdf",".pdf","2019-07-18T07:28:44.334","2019-05-18T13:42:34.696","2019-07-18T07:28:44.022","U:\\Merolapok motorsor\\Anker 1\\Merolapok\\","1905181341",2019,"5","18","13","41",null,2019,5,18,13,41,"Nappal","190518",1905180]
["Mérőlap_MSE4_A1_1905181612.pdf",".pdf","2019-07-18T07:28:45.102","2019-05-18T16:13:08.445","2019-07-18T07:28:44.866","U:\\Merolapok motorsor\\Anker 1\\Merolapok\\","1905181612",2019,"5","18","16","12",null,2019,5,18,16,12,"Nappal","190518",1905180]
["Mérőlap_MSE4_A1_1905211832.pdf",".pdf","2019-07-18T07:28:45.963","2019-05-21T18:33:12.753","2019-07-18T07:28:45.679","U:\\Merolapok motorsor\\Anker 1\\Merolapok\\","1905211832",2019,"5","21","18","32",null,2019,5,21,18,32,"Ejszaka","190521",19052100]
["Mérőlap_MSE4_A1_1905212020.pdf",".pdf","2019-07-18T07:28:46.783","2019-05-21T20:21:56.843","2019-07-18T07:28:46.514","U:\\Merolapok motorsor\\Anker 1\\Merolapok\\","1905212020",2019,"5","21","20","20",null,2019,5,21,20,20,"Ejszaka","190521",19052100]
["Mérőlap_MSE4_A1_1905212212.pdf",".pdf","2019-07-18T07:28:47.728","2019-05-21T22:14:17.552","2019-07-18T07:28:47.407","U:\\Merolapok motorsor\\Anker 1\\Merolapok\\","1905212212",2019,"5","21","22","12",null,2019,5,21,22,12,"Ejszaka","190521",19052100]
["Mérőlap_MSE4_A1_1905220034.pdf",".pdf","2019-07-18T07:28:48.750","2019-05-22T00:35:13.343","2019-07-18T07:28:48.508","U:\\Merolapok motorsor\\Anker 1\\Merolapok\\","1905220034",2019,"5","22","00","34",null,2019,5,22,0,34,"Ejszaka","190522",19052100]
["Mérőlap_MSE4_A1_1905220420.pdf",".pdf","2019-07-18T07:28:49.720","2019-05-22T04:21:43.573","2019-07-18T07:28:49.409","U:\\Merolapok motorsor\\Anker 1\\Merolapok\\","1905220420",2019,"5","22","04","20",null,2019,5,22,4,20,"Ejszaka","190522",19052100]
["Mérőlap_MSE4_A1_1905250620.pdf",".pdf","2019-07-18T07:28:50.704","2019-05-25T06:22:00.391","2019-07-18T07:28:50.374","U:\\Merolapok motorsor\\Anker 1\\Merolapok\\","1905250620",2019,"5","25","06","20",null,2019,5,25,6,20,"Nappal","190525",1905250]
["Mérőlap_MSE4_A1_1905250813.pdf",".pdf","2019-07-18T07:28:51.587","2019-05-25T08:14:01.985","2019-07-18T07:28:51.318","U:\\Merolapok motorsor\\Anker 1\\Merolapok\\","1905250813",2019,"5","25","08","13",null,2019,5,25,8,13,"Nappal","190525",1905250]
["Mérőlap_MSE4_A1_1905251217.pdf",".pdf","2019-07-18T07:28:53.131","2019-05-25T12:19:46.782","2019-07-18T07:28:52.195","U:\\Merolapok motorsor\\Anker 1\\Merolapok\\","1905251217",2019,"5","25","12","17",null,2019,5,25,12,17,"Nappal","190525",1905250]
["Mérőlap_MSE4_A1_1905260619.pdf",".pdf","2019-07-18T07:28:54.265","2019-05-26T06:24:41.448","2019-07-18T07:28:53.986","U:\\Merolapok motorsor\\Anker 1\\Merolapok\\","1905260619",2019,"5","26","06","19",null,2019,5,26,6,19,"Nappal","190526",1905260]
["Mérőlap_MSE4_A1_1905260804.pdf",".pdf","2019-07-18T07:28:55.265","2019-05-26T08:08:30.211","2019-07-18T07:28:54.965","U:\\Merolapok motorsor\\Anker 1\\Merolapok\\","1905260804",2019,"5","26","08","04",null,2019,5,26,8,4,"Nappal","190526",1905260]
["Mérőlap_MSE4_A1_1905261223.pdf",".pdf","2019-07-18T07:28:56.190","2019-05-26T12:24:43.643","2019-07-18T07:28:55.921","U:\\Merolapok motorsor\\Anker 1\\Merolapok\\","1905261223",2019,"5","26","12","23",null,2019,5,26,12,23,"Nappal","190526",1905260]
["Mérőlap_MSE4_A1_1905261403.pdf",".pdf","2019-07-18T07:28:57.180","2019-05-26T14:04:34.044","2019-07-18T07:28:56.898","U:\\Merolapok motorsor\\Anker 1\\Merolapok\\","1905261403",2019,"5","26","14","03",null,2019,5,26,14,3,"Nappal","190526",1905260]
["Mérőlap_MSE4_A1_1905292228.pdf",".pdf","2019-07-18T07:28:58.176","2019-05-29T22:29:43.008","2019-07-18T07:28:57.845","U:\\Merolapok motorsor\\Anker 1\\Merolapok\\","1905292228",2019,"5","29","22","28",null,2019,5,29,22,28,"Ejszaka","190529",19052900]
["Mérőlap_MSE4_A1_1905300032.pdf",".pdf","2019-07-18T07:28:59.091","2019-05-30T00:33:21.890","2019-07-18T07:28:58.777","U:\\Merolapok motorsor\\Anker 1\\Merolapok\\","1905300032",2019,"5","30","00","32",null,2019,5,30,0,32,"Ejszaka","190530",19052900]
["Mérőlap_MSE4_A1_1905300205.pdf",".pdf","2019-07-18T07:29:00.005","2019-05-30T02:06:22.909","2019-07-18T07:28:59.717","U:\\Merolapok motorsor\\Anker 1\\Merolapok\\","1905300205",2019,"5","30","02","05",null,2019,5,30,2,5,"Ejszaka","190530",19052900]
["Mérőlap_MSE4_A1_1905300428.pdf",".pdf","2019-07-18T07:29:00.965","2019-05-30T04:29:52.177","2019-07-18T07:29:00.707","U:\\Merolapok motorsor\\Anker 1\\Merolapok\\","1905300428",2019,"5","30","04","28",null,2019,5,30,4,28,"Ejszaka","190530",19052900]
["Mérőlap_MSE4_A1_1905301835.pdf",".pdf","2019-07-18T07:29:01.910","2019-05-30T18:36:04.077","2019-07-18T07:29:01.651","U:\\Merolapok motorsor\\Anker 1\\Merolapok\\","1905301835",2019,"5","30","18","35",null,2019,5,30,18,35,"Ejszaka","190530",19053000]
["Mérőlap_MSE4_A1_1905302008.pdf",".pdf","2019-07-18T07:29:02.977","2019-05-30T20:09:48.568","2019-07-18T07:29:02.604","U:\\Merolapok motorsor\\Anker 1\\Merolapok\\","1905302008",2019,"5","30","20","08",null,2019,5,30,20,8,"Ejszaka","190530",19053000]
["Mérőlap_MSE4_A1_1905302226.pdf",".pdf","2019-07-18T07:29:04.879","2019-05-30T22:27:35.638","2019-07-18T07:29:04.155","U:\\Merolapok motorsor\\Anker 1\\Merolapok\\","1905302226",2019,"5","30","22","26",null,2019,5,30,22,26,"Ejszaka","190530",19053000]
["Mérőlap_MSE4_A1_1906020627.pdf",".pdf","2019-07-18T07:29:06.371","2019-06-02T06:28:31.163","2019-07-18T07:29:05.731","U:\\Merolapok motorsor\\Anker 1\\Merolapok\\","1906020627",2019,"6","02","06","27",null,2019,6,2,6,27,"Nappal","190602",1906020]
["Mérőlap_MSE4_A1_1906021016.pdf",".pdf","2019-07-18T07:29:07.234","2019-06-02T10:24:44.926","2019-07-18T07:29:06.973","U:\\Merolapok motorsor\\Anker 1\\Merolapok\\","1906021016",2019,"6","02","10","16",null,2019,6,2,10,16,"Nappal","190602",1906020]
["Mérőlap_MSE4_A1_1906021423.pdf",".pdf","2019-07-18T07:29:08.264","2019-06-02T14:24:23.604","2019-07-18T07:29:07.960","U:\\Merolapok motorsor\\Anker 1\\Merolapok\\","1906021423",2019,"6","02","14","23",null,2019,6,2,14,23,"Nappal","190602",1906020]
["Mérőlap_MSE4_A1_1906021620.pdf",".pdf","2019-07-18T07:29:09.516","2019-06-02T16:21:23.537","2019-07-18T07:29:09.020","U:\\Merolapok motorsor\\Anker 1\\Merolapok\\","1906021620",2019,{"$f":"MID(G194,4,1)","v":"6"},{"$f":"MID(G194,5,2)","v":"02"},{"$f":"MID(G194,7,2)","v":"16"},{"$f":"MID(G194,9,2)","v":"20"},null,2019,6,2,16,20,"Nappal",{"$f":"MID(G194,1,6)","v":"190602"},1906020]
["Mérőlap_MSE4_A1_1906021945.pdf",".pdf","2019-07-18T07:29:10.739","2019-06-02T19:46:43.085","2019-07-18T07:29:10.155","U:\\Merolapok motorsor\\Anker 1\\Merolapok\\",{"$f":"MID(A195,17,10)","v":"1906021945"},2019,"6","02","19","45",null,2019,6,2,19,45,{"$f":"IF(Q195<6,\"Ejszaka\",IF(Q195<18,\"Nappal\",\"Ejszaka\"))","v":"Ejszaka"},"190602",{"$f":"IF(S195=\"Nappal\",T195*10,IF(Q195<6,T195*100-100,T195*100))","v":19060200}]
["Mérőlap_MSE4_A1_1906030941.pdf",".pdf","2019-07-18T07:29:12.376","2019-06-03T09:42:36.220","2019-07-18T07:29:12.039","U:\\Merolapok motorsor\\Anker 1\\Merolapok\\","1906030941",2019,"6","03","09","41",null,2019,6,3,9,41,"Nappal","190603",1906030]
["Mérőlap_MSE4_A1_1906031212.pdf",".pdf","2019-07-18T07:29:13.482","2019-06-03T12:17:55.686","2019-07-18T07:29:13.151","U:\\Merolapok motorsor\\Anker 1\\Merolapok\\","1906031212",2019,"6","03","12","12",null,2019,6,3,12,12,"Nappal","190603",1906030]
["Mérőlap_MSE4_A1_1906031618.pdf",".pdf","2019-07-18T07:29:14.470","2019-06-03T16:19:58.224","2019-07-18T07:29:14.179","U:\\Merolapok motorsor\\Anker 1\\Merolapok\\","1906031618",2019,"6","03","16","18",null,2019,6,3,16,18,"Nappal","190603",1906030]
["Mérőlap_MSE4_A1_1906031813.pdf",".pdf","2019-07-18T07:29:15.347","2019-06-03T18:14:15.124","2019-07-18T07:29:15.052","U:\\Merolapok motorsor\\Anker 1\\Merolapok\\","1906031813",2019,"6","03","18","13",null,2019,6,3,18,13,"Ejszaka","190603",19060300]
["Mérőlap_MSE4_A1_1906032039.pdf",".pdf","2019-07-18T07:29:16.330","2019-06-03T20:40:41.538","2019-07-18T07:29:16.070","U:\\Merolapok motorsor\\Anker 1\\Merolapok\\","1906032039",2019,"6","03","20","39",null,2019,6,3,20,39,"Ejszaka","190603",19060300]
["Mérőlap_MSE4_A1_1906032328.pdf",".pdf","2019-07-18T07:29:17.649","2019-06-03T23:28:57.606","2019-07-18T07:29:17.196","U:\\Merolapok motorsor\\Anker 1\\Merolapok\\","1906032328",2019,"6","03","23","28",null,2019,6,3,23,28,"Ejszaka","190603",19060300]
["Mérőlap_MSE4_A1_1906040149.pdf",".pdf","2019-07-18T07:29:18.550","2019-06-04T01:50:13.509","2019-07-18T07:29:18.263","U:\\Merolapok motorsor\\Anker 1\\Merolapok\\","1906040149",2019,"6","04","01","49",null,2019,6,4,1,49,"Ejszaka","190604",19060300]
["Mérőlap_MSE4_A1_1906040418.pdf",".pdf","2019-07-18T07:29:19.433","2019-06-04T04:19:32.035","2019-07-18T07:29:19.095","U:\\Merolapok motorsor\\Anker 1\\Merolapok\\","1906040418",2019,"6","04","04","18",null,2019,6,4,4,18,"Ejszaka","190604",19060300]
["Mérőlap_MSE4_A1_1906041840.pdf",".pdf","2019-07-18T07:29:20.337","2019-06-04T18:41:28.966","2019-07-18T07:29:20.068","U:\\Merolapok motorsor\\Anker 1\\Merolapok\\","1906041840",2019,"6","04","18","40",null,2019,6,4,18,40,"Ejszaka","190604",19060400]
["Mérőlap_MSE4_A1_1906042001.pdf",".pdf","2019-07-18T07:29:21.276","2019-06-04T20:02:52.651","2019-07-18T07:29:20.990","U:\\Merolapok motorsor\\Anker 1\\Merolapok\\","1906042001",2019,"6","04","20","01",null,2019,6,4,20,1,"Ejszaka","190604",19060400]
["Mérőlap_MSE4_A1_1906042202.pdf",".pdf","2019-07-18T07:29:22.269","2019-06-04T22:08:18.604","2019-07-18T07:29:21.973","U:\\Merolapok motorsor\\Anker 1\\Merolapok\\","1906042202",2019,"6","04","22","02",null,2019,6,4,22,2,"Ejszaka","190604",19060400]
["Mérőlap_MSE4_A1_1906050210.pdf",".pdf","2019-07-18T07:29:23.341","2019-06-05T02:11:38.091","2019-07-18T07:29:23.050","U:\\Merolapok motorsor\\Anker 1\\Merolapok\\","1906050210",2019,"6","05","02","10",null,2019,6,5,2,10,"Ejszaka","190605",19060400]
["Mérőlap_MSE4_A1_1906050356.pdf",".pdf","2019-07-18T07:29:24.254","2019-06-05T03:57:54.887","2019-07-18T07:29:23.940","U:\\Merolapok motorsor\\Anker 1\\Merolapok\\","1906050356",2019,"6","05","03","56",null,2019,6,5,3,56,"Ejszaka","190605",19060400]
["Mérőlap_MSE4_A1_1906061831.pdf",".pdf","2019-07-18T07:29:25.165","2019-06-06T18:32:17.845","2019-07-18T07:29:24.815","U:\\Merolapok motorsor\\Anker 1\\Merolapok\\","1906061831",2019,"6","06","18","31",null,2019,6,6,18,31,"Ejszaka","190606",19060600]
["Mérőlap_MSE4_A1_1906062153.pdf",".pdf","2019-07-18T07:29:26.139","2019-06-06T21:54:31.941","2019-07-18T07:29:25.902","U:\\Merolapok motorsor\\Anker 1\\Merolapok\\","1906062153",2019,"6","06","21","53",null,2019,6,6,21,53,"Ejszaka","190606",19060600]
["Mérőlap_MSE4_A1_1906070046.pdf",".pdf","2019-07-18T07:29:27.018","2019-06-07T00:48:10.571","2019-07-18T07:29:26.721","U:\\Merolapok motorsor\\Anker 1\\Merolapok\\","1906070046",2019,"6","07","00","46",null,2019,6,7,0,46,"Ejszaka","190607",19060600]
["Mérőlap_MSE4_A1_1906070228.pdf",".pdf","2019-07-18T07:29:27.859","2019-06-07T02:29:23.873","2019-07-18T07:29:27.549","U:\\Merolapok motorsor\\Anker 1\\Merolapok\\","1906070228",2019,"6","07","02","28",null,2019,6,7,2,28,"Ejszaka","190607",19060600]
["Mérőlap_MSE4_A1_1906071845.pdf",".pdf","2019-07-18T07:29:28.692","2019-06-07T18:46:53.320","2019-07-18T07:29:28.426","U:\\Merolapok motorsor\\Anker 1\\Merolapok\\","1906071845",2019,"6","07","18","45",null,2019,6,7,18,45,"Ejszaka","190607",19060700]
["Mérőlap_MSE4_A1_1906072003.pdf",".pdf","2019-07-18T07:29:29.497","2019-06-07T20:04:46.117","2019-07-18T07:29:29.252","U:\\Merolapok motorsor\\Anker 1\\Merolapok\\","1906072003",2019,"6","07","20","03",null,2019,6,7,20,3,"Ejszaka","190607",19060700]
["Mérőlap_MSE4_A1_1906072155.pdf",".pdf","2019-07-18T07:29:30.329","2019-06-07T21:57:06.225","2019-07-18T07:29:29.999","U:\\Merolapok motorsor\\Anker 1\\Merolapok\\","1906072155",2019,"6","07","21","55",null,2019,6,7,21,55,"Ejszaka","190607",19060700]
["Mérőlap_MSE4_A1_1906080219.pdf",".pdf","2019-07-18T07:29:31.205","2019-06-08T02:21:00.409","2019-07-18T07:29:30.955","U:\\Merolapok motorsor\\Anker 1\\Merolapok\\","1906080219",2019,"6","08","02","19",null,2019,6,8,2,19,"Ejszaka","190608",19060700]
["Mérőlap_MSE4_A1_1906080434.pdf",".pdf","2019-07-18T07:29:32.133","2019-06-08T04:36:01.227","2019-07-18T07:29:31.882","U:\\Merolapok motorsor\\Anker 1\\Merolapok\\","1906080434",2019,"6","08","04","34",null,2019,6,8,4,34,"Ejszaka","190608",19060700]
["Mérőlap_MSE4_A1_1906110639.pdf",".pdf","2019-07-18T07:29:33.053","2019-06-11T06:41:19.739","2019-07-18T07:29:32.731","U:\\Merolapok motorsor\\Anker 1\\Merolapok\\","1906110639",2019,"6","11","06","39",null,2019,6,11,6,39,"Nappal","190611",1906110]
["Mérőlap_MSE4_A1_1906110754.pdf",".pdf","2019-07-18T07:29:33.986","2019-06-11T07:55:23.626","2019-07-18T07:29:33.641","U:\\Merolapok motorsor\\Anker 1\\Merolapok\\","1906110754",2019,"6","11","07","54",null,2019,6,11,7,54,"Nappal","190611",1906110]
["Mérőlap_MSE4_A1_1906111031.pdf",".pdf","2019-07-18T07:29:35.054","2019-06-11T10:34:00.885","2019-07-18T07:29:34.736","U:\\Merolapok motorsor\\Anker 1\\Merolapok\\","1906111031",2019,"6","11","10","31",null,2019,6,11,10,31,"Nappal","190611",1906110]
["Mérőlap_MSE4_A1_1906111438.pdf",".pdf","2019-07-18T07:29:36.077","2019-06-11T14:39:35.931","2019-07-18T07:29:35.639","U:\\Merolapok motorsor\\Anker 1\\Merolapok\\","1906111438",2019,"6","11","14","38",null,2019,6,11,14,38,"Nappal","190611",1906110]
["Mérőlap_MSE4_A1_1906111616.pdf",".pdf","2019-07-18T07:29:36.952","2019-06-11T16:17:54.361","2019-07-18T07:29:36.657","U:\\Merolapok motorsor\\Anker 1\\Merolapok\\","1906111616",2019,"6","11","16","16",null,2019,6,11,16,16,"Nappal","190611",1906110]
["Mérőlap_MSE4_A1_1906141817.pdf",".pdf","2019-07-18T07:29:38.226","2019-06-14T18:19:39.398","2019-07-18T07:29:37.910","U:\\Merolapok motorsor\\Anker 1\\Merolapok\\","1906141817",2019,"6","14","18","17",null,2019,6,14,18,17,"Ejszaka","190614",19061400]
["Mérőlap_MSE4_A1_1906142019.pdf",".pdf","2019-07-18T07:29:39.444","2019-06-14T20:21:03.683","2019-07-18T07:29:39.090","U:\\Merolapok motorsor\\Anker 1\\Merolapok\\","1906142019",2019,"6","14","20","19",null,2019,6,14,20,19,"Ejszaka","190614",19061400]
["Mérőlap_MSE4_A1_1906142232.pdf",".pdf","2019-07-18T07:29:40.482","2019-06-14T22:33:39.639","2019-07-18T07:29:40.001","U:\\Merolapok motorsor\\Anker 1\\Merolapok\\","1906142232",2019,"6","14","22","32",null,2019,6,14,22,32,"Ejszaka","190614",19061400]
["Mérőlap_MSE4_A1_1906150048.pdf",".pdf","2019-07-18T07:29:43.228","2019-06-15T00:50:29.643","2019-07-18T07:29:42.825","U:\\Merolapok motorsor\\Anker 1\\Merolapok\\","1906150048",2019,"6","15","00","48",null,2019,6,15,0,48,"Ejszaka","190615",19061400]
["Mérőlap_MSE4_A1_1906150526.pdf",".pdf","2019-07-18T07:29:44.197","2019-06-15T05:27:03.846","2019-07-18T07:29:43.851","U:\\Merolapok motorsor\\Anker 1\\Merolapok\\","1906150526",2019,"6","15","05","26",null,2019,6,15,5,26,"Ejszaka","190615",19061400]
["Mérőlap_MSE4_A1_1906151830.pdf",".pdf","2019-07-18T07:29:44.975","2019-06-15T18:31:30.422","2019-07-18T07:29:44.739","U:\\Merolapok motorsor\\Anker 1\\Merolapok\\","1906151830",2019,"6","15","18","30",null,2019,6,15,18,30,"Ejszaka","190615",19061500]
["Mérőlap_MSE4_A1_1906152035.pdf",".pdf","2019-07-18T07:29:45.810","2019-06-15T20:37:26.242","2019-07-18T07:29:45.544","U:\\Merolapok motorsor\\Anker 1\\Merolapok\\","1906152035",2019,"6","15","20","35",null,2019,6,15,20,35,"Ejszaka","190615",19061500]
["Mérőlap_MSE4_A1_1906160147.pdf",".pdf","2019-07-18T07:29:46.734","2019-06-16T01:49:07.075","2019-07-18T07:29:46.385","U:\\Merolapok motorsor\\Anker 1\\Merolapok\\","1906160147",2019,"6","16","01","47",null,2019,6,16,1,47,"Ejszaka","190616",19061500]
["Mérőlap_MSE4_A1_1906160433.pdf",".pdf","2019-07-18T07:29:47.642","2019-06-16T04:34:12.628","2019-07-18T07:29:47.384","U:\\Merolapok motorsor\\Anker 1\\Merolapok\\","1906160433",2019,"6","16","04","33",null,2019,6,16,4,33,"Ejszaka","190616",19061500]
["Mérőlap_MSE4_A1_1906161904.pdf",".pdf","2019-07-18T07:29:48.680","2019-06-16T19:05:45.037","2019-07-18T07:29:48.454","U:\\Merolapok motorsor\\Anker 1\\Merolapok\\","1906161904",2019,"6","16","19","04",null,2019,6,16,19,4,"Ejszaka","190616",19061600]
["Mérőlap_MSE4_A1_1906162029.pdf",".pdf","2019-07-18T07:29:49.534","2019-06-16T20:30:34.064","2019-07-18T07:29:49.286","U:\\Merolapok motorsor\\Anker 1\\Merolapok\\","1906162029",2019,"6","16","20","29",null,2019,6,16,20,29,"Ejszaka","190616",19061600]
["Mérőlap_MSE4_A1_1906170139.pdf",".pdf","2019-07-18T07:29:50.423","2019-06-17T01:41:53.654","2019-07-18T07:29:50.142","U:\\Merolapok motorsor\\Anker 1\\Merolapok\\","1906170139",2019,"6","17","01","39",null,2019,6,17,1,39,"Ejszaka","190617",19061600]
["Mérőlap_MSE4_A1_1906180654.pdf",".pdf","2019-07-18T07:29:51.232","2019-06-18T06:55:24.975","2019-07-18T07:29:51.006","U:\\Merolapok motorsor\\Anker 1\\Merolapok\\","1906180654",2019,"6","18","06","54",null,2019,6,18,6,54,"Nappal","190618",1906180]
["Mérőlap_MSE4_A1_1906181235.pdf",".pdf","2019-07-18T07:29:52.120","2019-06-18T12:36:26.664","2019-07-18T07:29:51.876","U:\\Merolapok motorsor\\Anker 1\\Merolapok\\","1906181235",2019,"6","18","12","35",null,2019,6,18,12,35,"Nappal","190618",1906180]
["Mérőlap_MSE4_A1_1906181410.pdf",".pdf","2019-07-18T07:29:53.073","2019-06-18T14:12:09.991","2019-07-18T07:29:52.744","U:\\Merolapok motorsor\\Anker 1\\Merolapok\\","1906181410",2019,"6","18","14","10",null,2019,6,18,14,10,"Nappal","190618",1906180]
["Mérőlap_MSE4_A1_1906181622.pdf",".pdf","2019-07-18T07:29:53.999","2019-06-18T16:23:13.508","2019-07-18T07:29:53.724","U:\\Merolapok motorsor\\Anker 1\\Merolapok\\","1906181622",2019,"6","18","16","22",null,2019,6,18,16,22,"Nappal","190618",1906180]
["Mérőlap_MSE4_A1_1906190617.pdf",".pdf","2019-07-18T07:29:54.907","2019-06-19T06:18:33.719","2019-07-18T07:29:54.618","U:\\Merolapok motorsor\\Anker 1\\Merolapok\\","1906190617",2019,"6","19","06","17",null,2019,6,19,6,17,"Nappal","190619",1906190]
["Mérőlap_MSE4_A1_1906190956.pdf",".pdf","2019-07-18T07:29:55.751","2019-06-19T09:57:19.372","2019-07-18T07:29:55.411","U:\\Merolapok motorsor\\Anker 1\\Merolapok\\","1906190956",2019,"6","19","09","56",null,2019,6,19,9,56,"Nappal","190619",1906190]
["Mérőlap_MSE4_A1_1906191222.pdf",".pdf","2019-07-18T07:29:56.647","2019-06-19T12:23:09.992","2019-07-18T07:29:56.299","U:\\Merolapok motorsor\\Anker 1\\Merolapok\\","1906191222",2019,"6","19","12","22",null,2019,6,19,12,22,"Nappal","190619",1906190]
["Mérőlap_MSE4_A1_1906191356.pdf",".pdf","2019-07-18T07:29:57.580","2019-06-19T13:57:46.975","2019-07-18T07:29:57.254","U:\\Merolapok motorsor\\Anker 1\\Merolapok\\","1906191356",2019,"6","19","13","56",null,2019,6,19,13,56,"Nappal","190619",1906190]
["Mérőlap_MSE4_A1_1906221818.pdf",".pdf","2019-07-18T07:29:58.649","2019-06-22T18:20:08.788","2019-07-18T07:29:58.195","U:\\Merolapok motorsor\\Anker 1\\Merolapok\\","1906221818",2019,"6","22","18","18",null,2019,6,22,18,18,"Ejszaka","190622",19062200]
["Mérőlap_MSE4_A1_1906222008.pdf",".pdf","2019-07-18T07:30:00.278","2019-06-22T20:11:16.456","2019-07-18T07:29:59.265","U:\\Merolapok motorsor\\Anker 1\\Merolapok\\","1906222008",2019,"6","22","20","08",null,2019,6,22,20,8,"Ejszaka","190622",19062200]
["Mérőlap_MSE4_A1_1906230031.pdf",".pdf","2019-07-18T07:30:01.423","2019-06-23T00:32:17.408","2019-07-18T07:30:01.064","U:\\Merolapok motorsor\\Anker 1\\Merolapok\\","1906230031",2019,"6","23","00","31",null,2019,6,23,0,31,"Ejszaka","190623",19062200]
["Mérőlap_MSE4_A1_1906230235.pdf",".pdf","2019-07-18T07:30:02.695","2019-06-23T02:36:36.025","2019-07-18T07:30:02.245","U:\\Merolapok motorsor\\Anker 1\\Merolapok\\","1906230235",2019,"6","23","02","35",null,2019,6,23,2,35,"Ejszaka","190623",19062200]
["Mérőlap_MSE4_A1_1906230351.pdf",".pdf","2019-07-18T07:30:03.570","2019-06-23T03:51:25.072","2019-07-18T07:30:03.326","U:\\Merolapok motorsor\\Anker 1\\Merolapok\\","1906230351",2019,"6","23","03","51",null,2019,6,23,3,51,"Ejszaka","190623",19062200]
["Mérőlap_MSE4_A1_1906230355.pdf",".pdf","2019-07-18T07:30:04.406","2019-06-23T03:57:26.590","2019-07-18T07:30:04.143","U:\\Merolapok motorsor\\Anker 1\\Merolapok\\","1906230355",2019,"6","23","03","55",null,2019,6,23,3,55,"Ejszaka","190623",19062200]
["Mérőlap_MSE4_A1_1906230617.pdf",".pdf","2019-07-18T07:30:08.710","2019-06-23T06:18:37.477","2019-07-18T07:30:08.287","U:\\Merolapok motorsor\\Anker 1\\Merolapok\\","1906230617",2019,"6","23","06","17",null,2019,6,23,6,17,"Nappal","190623",1906230]
["Mérőlap_MSE4_A1_1906230818.pdf",".pdf","2019-07-18T07:30:10.435","2019-06-23T08:19:24.508","2019-07-18T07:30:09.556","U:\\Merolapok motorsor\\Anker 1\\Merolapok\\","1906230818",2019,"6","23","08","18",null,2019,6,23,8,18,"Nappal","190623",1906230]
["Mérőlap_MSE4_A1_1906230958.pdf",".pdf","2019-07-18T07:30:12.968","2019-06-23T09:58:40.946","2019-07-18T07:30:12.490","U:\\Merolapok motorsor\\Anker 1\\Merolapok\\","1906230958",2019,"6","23","09","58",null,2019,6,23,9,58,"Nappal","190623",1906230]
["Mérőlap_MSE4_A1_1906231153.pdf",".pdf","2019-07-18T07:30:14.196","2019-06-23T11:53:30.914","2019-07-18T07:30:13.731","U:\\Merolapok motorsor\\Anker 1\\Merolapok\\","1906231153",2019,"6","23","11","53",null,2019,6,23,11,53,"Nappal","190623",1906230]
["Mérőlap_MSE4_A1_1906231358.pdf",".pdf","2019-07-18T07:30:15.101","2019-06-23T13:58:46.414","2019-07-18T07:30:14.826","U:\\Merolapok motorsor\\Anker 1\\Merolapok\\","1906231358",2019,"6","23","13","58",null,2019,6,23,13,58,"Nappal","190623",1906230]
["Mérőlap_MSE4_A1_1906231602.pdf",".pdf","2019-07-18T07:30:15.854","2019-06-23T16:02:54.833","2019-07-18T07:30:15.622","U:\\Merolapok motorsor\\Anker 1\\Merolapok\\","1906231602",2019,"6","23","16","02",null,2019,6,23,16,2,"Nappal","190623",1906230]
["Mérőlap_MSE4_A1_1906231822.pdf",".pdf","2019-07-18T07:30:16.696","2019-06-23T18:23:51.622","2019-07-18T07:30:16.411","U:\\Merolapok motorsor\\Anker 1\\Merolapok\\","1906231822",2019,"6","23","18","22",null,2019,6,23,18,22,"Ejszaka","190623",19062300]
["Mérőlap_MSE4_A1_1906240108.pdf",".pdf","2019-07-18T07:30:17.645","2019-06-24T01:11:27.073","2019-07-18T07:30:17.366","U:\\Merolapok motorsor\\Anker 1\\Merolapok\\","1906240108",2019,"6","24","01","08",null,2019,6,24,1,8,"Ejszaka","190624",19062300]
["Mérőlap_MSE4_A1_1906240246.pdf",".pdf","2019-07-18T07:30:18.497","2019-06-24T02:47:31.350","2019-07-18T07:30:18.255","U:\\Merolapok motorsor\\Anker 1\\Merolapok\\","1906240246",2019,"6","24","02","46",null,2019,6,24,2,46,"Ejszaka","190624",19062300]
["Mérőlap_MSE4_A1_1906240432.pdf",".pdf","2019-07-18T07:30:19.394","2019-06-24T04:33:54.555","2019-07-18T07:30:19.092","U:\\Merolapok motorsor\\Anker 1\\Merolapok\\","1906240432",2019,{"$f":"MID(G258,4,1)","v":"6"},{"$f":"MID(G258,5,2)","v":"24"},{"$f":"MID(G258,7,2)","v":"04"},{"$f":"MID(G258,9,2)","v":"32"},null,2019,6,24,4,32,"Ejszaka",{"$f":"MID(G258,1,6)","v":"190624"},19062300]
["Mérőlap_MSE4_A1_1906260708.pdf",".pdf","2019-07-18T07:30:20.114","2019-06-26T07:09:01.658","2019-07-18T07:30:19.921","U:\\Merolapok motorsor\\Anker 1\\Merolapok\\",{"$f":"MID(A259,17,10)","v":"1906260708"},2019,"6","26","07","08",null,2019,6,26,7,8,{"$f":"IF(Q259<6,\"Ejszaka\",IF(Q259<18,\"Nappal\",\"Ejszaka\"))","v":"Nappal"},"190626",{"$f":"IF(S259=\"Nappal\",T259*10,IF(Q259<6,T259*100-100,T259*100))","v":1906260}]
["Mérőlap_MSE4_A1_1906260821.pdf",".pdf","2019-07-18T07:30:20.674","2019-06-26T08:21:08.888","2019-07-18T07:30:20.488","U:\\Merolapok motorsor\\Anker 1\\Merolapok\\","1906260821",2019,"6","26","08","21",null,2019,6,26,8,21,"Nappal","190626",1906260]
["Mérőlap_MSE4_A1_1906261018.pdf",".pdf","2019-07-18T07:30:21.343","2019-06-26T10:18:48.605","2019-07-18T07:30:21.032","U:\\Merolapok motorsor\\Anker 1\\Merolapok\\","1906261018",2019,"6","26","10","18",null,2019,6,26,10,18,"Nappal","190626",1906260]
["Mérőlap_MSE4_A1_1906261206.pdf",".pdf","2019-07-18T07:30:21.999","2019-06-26T12:06:37.071","2019-07-18T07:30:21.729","U:\\Merolapok motorsor\\Anker 1\\Merolapok\\","1906261206",2019,"6","26","12","06",null,2019,6,26,12,6,"Nappal","190626",1906260]
["Mérőlap_MSE4_A1_1906261443.pdf",".pdf","2019-07-18T07:30:22.806","2019-06-26T14:43:30.358","2019-07-18T07:30:22.599","U:\\Merolapok motorsor\\Anker 1\\Merolapok\\","1906261443",2019,"6","26","14","43",null,2019,6,26,14,43,"Nappal","190626",1906260]
["Mérőlap_MSE4_A1_1906261620.pdf",".pdf","2019-07-18T07:30:23.530","2019-06-26T16:20:55.077","2019-07-18T07:30:23.275","U:\\Merolapok motorsor\\Anker 1\\Merolapok\\","1906261620",2019,"6","26","16","20",null,2019,6,26,16,20,"Nappal","190626",1906260]
["Mérőlap_MSE4_A1_1906270619.pdf",".pdf","2019-07-18T07:30:24.431","2019-06-27T06:20:49.167","2019-07-18T07:30:24.195","U:\\Merolapok motorsor\\Anker 1\\Merolapok\\","1906270619",2019,"6","27","06","19",null,2019,6,27,6,19,"Nappal","190627",1906270]
["Mérőlap_MSE4_A1_1906270934.pdf",".pdf","2019-07-18T07:30:25.474","2019-06-27T09:35:48.886","2019-07-18T07:30:25.148","U:\\Merolapok motorsor\\Anker 1\\Merolapok\\","1906270934",2019,"6","27","09","34",null,2019,6,27,9,34,"Nappal","190627",1906270]
["Mérőlap_MSE4_A1_1906271147.pdf",".pdf","2019-07-18T07:30:26.613","2019-06-27T11:48:13.661","2019-07-18T07:30:26.320","U:\\Merolapok motorsor\\Anker 1\\Merolapok\\","1906271147",2019,"6","27","11","47",null,2019,6,27,11,47,"Nappal","190627",1906270]
["Mérőlap_MSE4_A1_1906271559.pdf",".pdf","2019-07-18T07:30:27.677","2019-06-27T16:01:24.902","2019-07-18T07:30:27.268","U:\\Merolapok motorsor\\Anker 1\\Merolapok\\","1906271559",2019,"6","27","15","59",null,2019,6,27,15,59,"Nappal","190627",1906270]
["Mérőlap_MSE4_A1_1906271815.pdf",".pdf","2019-07-18T07:30:29.032","2019-06-27T18:16:21.996","2019-07-18T07:30:28.800","U:\\Merolapok motorsor\\Anker 1\\Merolapok\\","1906271815",2019,"6","27","18","15",null,2019,6,27,18,15,"Ejszaka","190627",19062700]
["Mérőlap_MSE4_A1_1906271959.pdf",".pdf","2019-07-18T07:30:29.930","2019-06-27T19:59:49.566","2019-07-18T07:30:29.652","U:\\Merolapok motorsor\\Anker 1\\Merolapok\\","1906271959",2019,"6","27","19","59",null,2019,6,27,19,59,"Ejszaka","190627",19062700]
["Mérőlap_MSE4_A1_1906272221.pdf",".pdf","2019-07-18T07:30:30.894","2019-06-27T22:22:07.577","2019-07-18T07:30:30.571","U:\\Merolapok motorsor\\Anker 1\\Merolapok\\","1906272221",2019,"6","27","22","21",null,2019,6,27,22,21,"Ejszaka","190627",19062700]
["Mérőlap_MSE4_A1_1906280027.pdf",".pdf","2019-07-18T07:30:32.045","2019-06-28T00:28:23.566","2019-07-18T07:30:31.516","U:\\Merolapok motorsor\\Anker 1\\Merolapok\\","1906280027",2019,"6","28","00","27",null,2019,6,28,0,27,"Ejszaka","190628",19062700]
["Mérőlap_MSE4_A1_1906280231.pdf",".pdf","2019-07-18T07:30:33.184","2019-06-28T02:32:21.800","2019-07-18T07:30:32.792","U:\\Merolapok motorsor\\Anker 1\\Merolapok\\","1906280231",2019,"6","28","02","31",null,2019,6,28,2,31,"Ejszaka","190628",19062700]
["Mérőlap_MSE4_A1_1906280519.pdf",".pdf","2019-07-18T07:30:34.253","2019-06-28T05:20:11.343","2019-07-18T07:30:33.989","U:\\Merolapok motorsor\\Anker 1\\Merolapok\\","1906280519",2019,"6","28","05","19",null,2019,6,28,5,19,"Ejszaka","190628",19062700]
["Mérőlap_MSE4_A1_1906280631.pdf",".pdf","2019-07-18T07:30:36.286","2019-06-28T06:32:37.449","2019-07-18T07:30:35.896","U:\\Merolapok motorsor\\Anker 1\\Merolapok\\","1906280631",2019,"6","28","06","31",null,2019,6,28,6,31,"Nappal","190628",1906280]
["Mérőlap_MSE4_A1_1906280813.pdf",".pdf","2019-07-18T07:30:37.254","2019-06-28T08:14:41.793","2019-07-18T07:30:36.950","U:\\Merolapok motorsor\\Anker 1\\Merolapok\\","1906280813",2019,"6","28","08","13",null,2019,6,28,8,13,"Nappal","190628",1906280]
["Mérőlap_MSE4_A1_1906281002.pdf",".pdf","2019-07-18T07:30:38.231","2019-06-28T10:04:03.504","2019-07-18T07:30:37.953","U:\\Merolapok motorsor\\Anker 1\\Merolapok\\","1906281002",2019,"6","28","10","02",null,2019,6,28,10,2,"Nappal","190628",1906280]
["Mérőlap_MSE4_A1_1906281243.pdf",".pdf","2019-07-18T07:30:39.558","2019-06-28T12:44:51.319","2019-07-18T07:30:39.238","U:\\Merolapok motorsor\\Anker 1\\Merolapok\\","1906281243",2019,"6","28","12","43",null,2019,6,28,12,43,"Nappal","190628",1906280]
["Mérőlap_MSE4_A1_1906281403.pdf",".pdf","2019-07-18T07:30:42.610","2019-06-28T14:04:49.898","2019-07-18T07:30:40.748","U:\\Merolapok motorsor\\Anker 1\\Merolapok\\","1906281403",2019,"6","28","14","03",null,2019,6,28,14,3,"Nappal","190628",1906280]
["Mérőlap_MSE4_A1_1906281622.pdf",".pdf","2019-07-18T07:30:44.819","2019-06-28T16:23:47.031","2019-07-18T07:30:43.611","U:\\Merolapok motorsor\\Anker 1\\Merolapok\\","1906281622",2019,"6","28","16","22",null,2019,6,28,16,22,"Nappal","190628",1906280]
["Mérőlap_MSE4_A1_1906302010.pdf",".pdf","2019-07-18T07:30:46.003","2019-06-30T20:11:46.587","2019-07-18T07:30:45.741","U:\\Merolapok motorsor\\Anker 1\\Merolapok\\","1906302010",2019,"6","30","20","10",null,2019,6,30,20,10,"Ejszaka","190630",19063000]
["Mérőlap_MSE4_A1_1906302148.pdf",".pdf","2019-07-18T07:30:46.862","2019-06-30T21:50:06.328","2019-07-18T07:30:46.639","U:\\Merolapok motorsor\\Anker 1\\Merolapok\\","1906302148",2019,"6","30","21","48",null,2019,6,30,21,48,"Ejszaka","190630",19063000]
["Mérőlap_MSE4_A1_1907010040.pdf",".pdf","2019-07-18T07:30:47.884","2019-07-01T00:41:26.391","2019-07-18T07:30:47.630","U:\\Merolapok motorsor\\Anker 1\\Merolapok\\","1907010040",2019,"7","01","00","40",null,2019,7,1,0,40,"Ejszaka","190701",19070000]
["Mérőlap_MSE4_A1_1907010231.pdf",".pdf","2019-07-18T07:30:49.091","2019-07-01T02:32:25.682","2019-07-18T07:30:48.611","U:\\Merolapok motorsor\\Anker 1\\Merolapok\\","1907010231",2019,"7","01","02","31",null,2019,7,1,2,31,"Ejszaka","190701",19070000]
["Mérőlap_MSE4_A1_1907010430.pdf",".pdf","2019-07-18T07:30:50.705","2019-07-01T04:31:14.510","2019-07-18T07:30:50.422","U:\\Merolapok motorsor\\Anker 1\\Merolapok\\","1907010430",2019,"7","01","04","30",null,2019,7,1,4,30,"Ejszaka","190701",19070000]
["Mérőlap_MSE4_A1_1907011854.pdf",".pdf","2019-07-18T07:30:51.529","2019-07-01T18:55:33.104","2019-07-18T07:30:51.244","U:\\Merolapok motorsor\\Anker 1\\Merolapok\\","1907011854",2019,"7","01","18","54",null,2019,7,1,18,54,"Ejszaka","190701",19070100]
["Mérőlap_MSE4_A1_1907012021.pdf",".pdf","2019-07-18T07:30:52.346","2019-07-01T20:22:54.874","2019-07-18T07:30:52.102","U:\\Merolapok motorsor\\Anker 1\\Merolapok\\","1907012021",2019,"7","01","20","21",null,2019,7,1,20,21,"Ejszaka","190701",19070100]
["Mérőlap_MSE4_A1_1907012240.pdf",".pdf","2019-07-18T07:30:53.321","2019-07-01T22:41:41.081","2019-07-18T07:30:52.977","U:\\Merolapok motorsor\\Anker 1\\Merolapok\\","1907012240",2019,"7","01","22","40",null,2019,7,1,22,40,"Ejszaka","190701",19070100]
["Mérőlap_MSE4_A1_1907020457.pdf",".pdf","2019-07-18T07:30:54.215","2019-07-02T05:13:02.821","2019-07-18T07:30:53.906","U:\\Merolapok motorsor\\Anker 1\\Merolapok\\","1907020457",2019,"7","02","04","57",null,2019,7,2,4,57,"Ejszaka","190702",19070100]
["Mérőlap_MSE4_A1_1907040618.pdf",".pdf","2019-07-18T07:30:55.043","2019-07-04T06:19:35.686","2019-07-18T07:30:54.804","U:\\Merolapok motorsor\\Anker 1\\Merolapok\\","1907040618",2019,"7","04","06","18",null,2019,7,4,6,18,"Nappal","190704",1907040]
["Mérőlap_MSE4_A1_1907040832.pdf",".pdf","2019-07-18T07:30:55.803","2019-07-04T08:34:05.850","2019-07-18T07:30:55.564","U:\\Merolapok motorsor\\Anker 1\\Merolapok\\","1907040832",2019,"7","04","08","32",null,2019,7,4,8,32,"Nappal","190704",1907040]
["Mérőlap_MSE4_A1_1907041025.pdf",".pdf","2019-07-18T07:30:56.725","2019-07-04T10:27:00.763","2019-07-18T07:30:56.459","U:\\Merolapok motorsor\\Anker 1\\Merolapok\\","1907041025",2019,"7","04","10","25",null,2019,7,4,10,25,"Nappal","190704",1907040]
["Mérőlap_MSE4_A1_1907041424.pdf",".pdf","2019-07-18T07:30:57.640","2019-07-04T14:25:09.745","2019-07-18T07:30:57.412","U:\\Merolapok motorsor\\Anker 1\\Merolapok\\","1907041424",2019,"7","04","14","24",null,2019,7,4,14,24,"Nappal","190704",1907040]
["Mérőlap_MSE4_A1_1907041629.pdf",".pdf","2019-07-18T07:30:58.679","2019-07-04T16:30:47.648","2019-07-18T07:30:58.376","U:\\Merolapok motorsor\\Anker 1\\Merolapok\\","1907041629",2019,"7","04","16","29",null,2019,7,4,16,29,"Nappal","190704",1907040]
["Mérőlap_MSE4_A1_1907050616.pdf",".pdf","2019-07-18T07:30:59.643","2019-07-05T06:17:46.493","2019-07-18T07:30:59.343","U:\\Merolapok motorsor\\Anker 1\\Merolapok\\","1907050616",2019,"7","05","06","16",null,2019,7,5,6,16,"Nappal","190705",1907050]
["Mérőlap_MSE4_A1_1907050848.pdf",".pdf","2019-07-18T07:31:00.742","2019-07-05T08:49:10.341","2019-07-18T07:31:00.309","U:\\Merolapok motorsor\\Anker 1\\Merolapok\\","1907050848",2019,"7","05","08","48",null,2019,7,5,8,48,"Nappal","190705",1907050]
["Mérőlap_MSE4_A1_1907051023.pdf",".pdf","2019-07-18T07:31:01.852","2019-07-05T10:24:36.127","2019-07-18T07:31:01.511","U:\\Merolapok motorsor\\Anker 1\\Merolapok\\","1907051023",2019,"7","05","10","23",null,2019,7,5,10,23,"Nappal","190705",1907050]
["Mérőlap_MSE4_A1_1907051215.pdf",".pdf","2019-07-18T07:31:02.809","2019-07-05T12:16:41.483","2019-07-18T07:31:02.485","U:\\Merolapok motorsor\\Anker 1\\Merolapok\\","1907051215",2019,"7","05","12","15",null,2019,7,5,12,15,"Nappal","190705",1907050]
["Mérőlap_MSE4_A1_1907051644.pdf",".pdf","2019-07-18T07:31:03.820","2019-07-05T16:46:02.197","2019-07-18T07:31:03.516","U:\\Merolapok motorsor\\Anker 1\\Merolapok\\","1907051644",2019,"7","05","16","44",null,2019,7,5,16,44,"Nappal","190705",1907050]
["Mérőlap_MSE4_A1_1907081821.pdf",".pdf","2019-07-18T07:31:04.999","2019-07-08T18:23:11.974","2019-07-18T07:31:04.673","U:\\Merolapok motorsor\\Anker 1\\Merolapok\\","1907081821",2019,"7","08","18","21",null,2019,7,8,18,21,"Ejszaka","190708",19070800]
["Mérőlap_MSE4_A1_1907082051.pdf",".pdf","2019-07-18T07:31:05.994","2019-07-08T20:52:47.221","2019-07-18T07:31:05.724","U:\\Merolapok motorsor\\Anker 1\\Merolapok\\","1907082051",2019,"7","08","20","51",null,2019,7,8,20,51,"Ejszaka","190708",19070800]
["Mérőlap_MSE4_A1_1907082242.pdf",".pdf","2019-07-18T07:31:07.187","2019-07-08T22:43:57.102","2019-07-18T07:31:06.953","U:\\Merolapok motorsor\\Anker 1\\Merolapok\\","1907082242",2019,"7","08","22","42",null,2019,7,8,22,42,"Ejszaka","190708",19070800]
["Mérőlap_MSE4_A1_1907090229.pdf",".pdf","2019-07-18T07:31:08.262","2019-07-09T02:30:46.798","2019-07-18T07:31:07.854","U:\\Merolapok motorsor\\Anker 1\\Merolapok\\","1907090229",2019,"7","09","02","29",null,2019,7,9,2,29,"Ejszaka","190709",19070800]
["Mérőlap_MSE4_A1_1907090422.pdf",".pdf","2019-07-18T07:31:09.225","2019-07-09T04:23:17.340","2019-07-18T07:31:08.977","U:\\Merolapok motorsor\\Anker 1\\Merolapok\\","1907090422",2019,"7","09","04","22",null,2019,7,9,4,22,"Ejszaka","190709",19070800]
["Mérőlap_MSE4_A1_1907120723.pdf",".pdf","2019-07-18T07:31:10.099","2019-07-12T07:23:40.794","2019-07-18T07:31:09.804","U:\\Merolapok motorsor\\Anker 1\\Merolapok\\","1907120723",2019,"7","12","07","23",null,2019,7,12,7,23,"Nappal","190712",1907120]
["Mérőlap_MSE4_A1_1907121236.pdf",".pdf","2019-07-18T07:31:10.805","2019-07-12T12:36:09.282","2019-07-18T07:31:10.512","U:\\Merolapok motorsor\\Anker 1\\Merolapok\\","1907121236",2019,"7","12","12","36",null,2019,7,12,12,36,"Nappal","190712",1907120]
["Mérőlap_MSE4_A1_1907121525.pdf",".pdf","2019-07-18T07:31:11.497","2019-07-12T15:25:44.520","2019-07-18T07:31:11.311","U:\\Merolapok motorsor\\Anker 1\\Merolapok\\","1907121525",2019,"7","12","15","25",null,2019,7,12,15,25,"Nappal","190712",1907120]
["Mérőlap_MSE4_A1_1907130618.pdf",".pdf","2019-07-18T07:31:12.205","2019-07-13T06:19:33.006","2019-07-18T07:31:11.971","U:\\Merolapok motorsor\\Anker 1\\Merolapok\\","1907130618",2019,"7","13","06","18",null,2019,7,13,6,18,"Nappal","190713",1907130]
["Mérőlap_MSE4_A1_1907130812.pdf",".pdf","2019-07-18T07:31:13.127","2019-07-13T08:14:06.367","2019-07-18T07:31:12.867","U:\\Merolapok motorsor\\Anker 1\\Merolapok\\","1907130812",2019,"7","13","08","12",null,2019,7,13,8,12,"Nappal","190713",1907130]
["Mérőlap_MSE4_A1_1907131313.pdf",".pdf","2019-07-18T07:31:14.077","2019-07-13T13:15:10.040","2019-07-18T07:31:13.767","U:\\Merolapok motorsor\\Anker 1\\Merolapok\\","1907131313",2019,"7","13","13","13",null,2019,7,13,13,13,"Nappal","190713",1907130]
["Mérőlap_MSE4_A1_1907131603.pdf",".pdf","2019-07-18T07:31:14.952","2019-07-13T16:04:33.376","2019-07-18T07:31:14.742","U:\\Merolapok motorsor\\Anker 1\\Merolapok\\","1907131603",2019,"7","13","16","03",null,2019,7,13,16,3,"Nappal","190713",1907130]
["Mérőlap_MSE4_A1_1907171818.pdf",".pdf","2019-07-18T07:31:15.969","2019-07-17T18:19:19.523","2019-07-18T07:31:15.622","U:\\Merolapok motorsor\\Anker 1\\Merolapok\\","1907171818",2019,"7","17","18","18",null,2019,7,17,18,18,"Ejszaka","190717",19071700]
["Mérőlap_MSE4_A1_1907172009.pdf",".pdf","2019-07-18T07:31:16.909","2019-07-17T20:11:03.654","2019-07-18T07:31:16.607","U:\\Merolapok motorsor\\Anker 1\\Merolapok\\","1907172009",2019,"7","17","20","09",null,2019,7,17,20,9,"Ejszaka","190717",19071700]
["Mérőlap_MSE4_A1_1907172216.pdf",".pdf","2019-07-18T07:31:17.894","2019-07-17T22:19:23.289","2019-07-18T07:31:17.578","U:\\Merolapok motorsor\\Anker 1\\Merolapok\\","1907172216",2019,"7","17","22","16",null,2019,7,17,22,16,"Ejszaka","190717",19071700]
["Mérőlap_MSE4_A1_1907180040.pdf",".pdf","2019-07-18T07:31:18.796","2019-07-18T00:41:21.081","2019-07-18T07:31:18.533","U:\\Merolapok motorsor\\Anker 1\\Merolapok\\","1907180040",2019,"7","18","00","40",null,2019,7,18,0,40,"Ejszaka","190718",19071700]
["Mérőlap_MSE4_A1_1907180204.pdf",".pdf","2019-07-18T07:31:19.661","2019-07-18T02:06:05.460","2019-07-18T07:31:19.428","U:\\Merolapok motorsor\\Anker 1\\Merolapok\\","1907180204",2019,"7","18","02","04",null,2019,7,18,2,4,"Ejszaka","190718",19071700]
[{"$nulls":6},""]
[{"$nulls":6},""]
[{"$nulls":6},""]
[{"$nulls":6},""]
[{"$nulls":6},""]
[{"$nulls":6},""]
[{"$nulls":6},{"$f":"MID(A323,17,10)","v":""}]
[{"$nulls":6},""]
[{"$nulls":6},""]
[{"$nulls":6},""]
[{"$nulls":6},""]
[{"$nulls":6},""]
[{"$nulls":6},""]
[{"$nulls":6},""]
[{"$nulls":6},""]
[{"$nulls":6},""]
[{"$nulls":6},""]
[{"$nulls":6},""]
[{"$nulls":6},""]
[{"$nulls":6},""]
[{"$nulls":6},""]
[{"$nulls":6},""]
[{"$nulls":6},""]
[{"$nulls":6},""]
[{"$nulls":6},""]
[{"$nulls":6},""]
[{"$nulls":6},""]
[{"$nulls":6},""]
[{"$nulls":6},""]
[{"$nulls":6},""]
[{"$nulls":6},""]
[{"$nulls":6},""]
[{"$nulls":6},""]
[{"$nulls":6},""]
[{"$nulls":6},""]
[{"$nulls":6},""]
[{"$nulls":6},""]
[{"$nulls":6},""]
[{"$nulls":6},""]
[{"$nulls":6},""]
[{"$nulls":6},""]
[{"$nulls":6},""]
[{"$nulls":6},""]
[{"$nulls":6},""]
[{"$nulls":6},""]
[{"$nulls":6},""]
[{"$nulls":6},""]
[{"$nulls":6},""]
[{"$nulls":6},""]
[{"$nulls":6},""]
[{"$nulls":6},""]
[{"$nulls":6},""]
[{"$nulls":6},""]
[{"$nulls":6},""]
[{"$nulls":6},""]
[{"$nulls":6},""]
[{"$nulls":6},""]
[{"$nulls":6},""]
[{"$nulls":6},""]
[{"$nulls":6},""]
[{"$nulls":6},""]
[{"$nulls":6},""]
[{"$nulls":6},""]
[{"$nulls":6},""]
[{"$nulls":6},""]
[{"$nulls":6},""]
[{"$nulls":6},""]
[{"$nulls":6},""]
[{"$nulls":6},""]
[{"$nulls":6},""]
[{"$nulls":6},{"$f":"MID(A387,17,10)","v":""}]
[{"$nulls":6},""]
[{"$nulls":6},""]
[{"$nulls":6},""]
[{"$nulls":6},""]
[{"$nulls":6},""]
[{"$nulls":6},""]
[{"$nulls":6},""]
[{"$nulls":6},""]
[{"$nulls":6},""]
[{"$nulls":6},""]
[{"$nulls":6},""]
[{"$nulls":6},""]
[{"$nulls":6},""]
[{"$nulls":6},""]
[{"$nulls":6},""]
[{"$nulls":6},""]
[{"$nulls":6},""]
[{"$nulls":6},""]
[{"$nulls":6},""]
[{"$nulls":6},""]
[{"$nulls":6},""]
[{"$nulls":6},""]
[{"$nulls":6},""]
[{"$nulls":6},""]
[{"$nulls":6},""]
[{"$nulls":6},""]
[{"$nulls":6},""]
[{"$nulls":6},""]
[{"$nulls":6},""]
[{"$nulls":6},""]
[{"$nulls":6},""]
[{"$nulls":6},""]
[{"$nulls":6},""]
[{"$nulls":6},""]
[{"$nulls":6},""]
[{"$nulls":6},""]
[{"$nulls":6},""]
[{"$nulls":6},""]
[{"$nulls":6},""]
[{"$nulls":6},""]
[{"$nulls":6},""]
[{"$nulls":6},""]
[{"$nulls":6},""]
[{"$nulls":6},""]
[{"$nulls":6},""]
[{"$nulls":6},""]
[{"$nulls":6},""]
[{"$nulls":6},""]
[{"$nulls":6},""]

{"sheet":"SPC","index":3,"n_rows":104,"n_cols":22,"rows_kept":104}
["Name","Extension","Date accessed","Date modified","Date created","Folder Path",null,"Datum","Év","Hónap","Nap","Óra","Perc","Műszak","Év","Hónap","Nap","Óra","Perc","Műszak","Datum","Datum+muszak"]
["Mérőlap_MSE4_A1_1906020627.xls.pdf",".pdf","2019-07-22T10:11:16.729","2019-06-02T06:28:00.625","2019-07-22T10:11:16.433","U:\\Merolapok motorsor\\SPC lapok\\",null,{"$f":"MID(SPC_lapok[[#This Row],[Name]],17,10)","v":"1906020627"},2019,{"$f":"MID(H2,4,1)","v":"6"},{"$f":"MID(H2,5,2)","v":"02"},{"$f":"MID(H2,7,2)","v":"06"},{"$f":"MID(H2,9,2)","v":"27"},{"$f":"IF(L2<6,\"Ejszaka\",IF(L2<18,\"Nappal\",\"Ejszaka\"))","v":"Ejszaka"},2019,6,2,6,27,{"$f":"IF(R2<6,\"Ejszaka\",IF(R2<18,\"Nappal\",\"Ejszaka\"))","v":"Nappal"},{"$f":"MID(H2,1,6)","v":"190602"},{"$f":"IF(T2=\"Nappal\",U2*10,IF(R2<6,U2*100-100,U2*100))","v":1906020}]
["Mérőlap_MSE4_A1_1906021016.xls.pdf",".pdf","2019-07-22T10:11:17.096","2019-06-02T10:24:15.479","2019-07-22T10:11:16.790","U:\\Merolapok motorsor\\SPC lapok\\",null,{"$f":"MID(SPC_lapok[[#This Row],[Name]],17,10)","v":"1906021016"},2019,{"$f":"MID(H3,4,1)","v":"6"},{"$f":"MID(H3,5,2)","v":"02"},"10",{"$f":"MID(H3,9,2)","v":"16"},null,2019,6,2,10,16,{"$f":"IF(R3<6,\"Ejszaka\",IF(R3<18,\"Nappal\",\"Ejszaka\"))","v":"Nappal"},{"$f":"MID(H3,1,6)","v":"190602"},{"$f":"IF(T3=\"Nappal\",U3*10,IF(R3<6,U3*100-100,U3*100))","v":1906020}]
["Mérőlap_MSE4_A1_1906021423.xls.pdf",".pdf","2019-07-22T10:11:17.497","2019-06-02T14:23:48.991","2019-07-22T10:11:17.155","U:\\Merolapok motorsor\\SPC lapok\\",null,{"$f":"MID(SPC_lapok[[#This Row],[Name]],17,10)","v":"1906021423"},2019,"6","02","14","23",null,2019,6,2,14,23,"Nappal","190602",1906020]
["Mérőlap_MSE4_A1_1906021620.xls.pdf",".pdf","2019-07-22T10:11:17.954","2019-06-02T16:20:50.507","2019-07-22T10:11:17.562","U:\\Merolapok motorsor\\SPC lapok\\",null,{"$f":"MID(SPC_lapok[[#This Row],[Name]],17,10)","v":"1906021620"},2019,"6","02","16","20",null,2019,6,2,16,20,"Nappal","190602",1906020]
["Mérőlap_MSE4_A1_1906030941.xls.pdf",".pdf","2019-07-22T10:11:18.386","2019-06-03T09:41:35.009","2019-07-22T10:11:18.075","U:\\Merolapok motorsor\\SPC lapok\\",null,{"$f":"MID(SPC_lapok[[#This Row],[Name]],17,10)","v":"1906030941"},2019,"6","03","09","41",null,2019,6,3,9,41,"Nappal","190603",1906030]
["Mérőlap_MSE4_A1_1906031212.xls.pdf",".pdf","2019-07-22T10:11:18.848","2019-06-03T12:17:18.166","2019-07-22T10:11:18.460","U:\\Merolapok motorsor\\SPC lapok\\",null,{"$f":"MID(SPC_lapok[[#This Row],[Name]],17,10)","v":"1906031212"},2019,"6","03","12","12",null,2019,6,3,12,12,"Nappal","190603",1906030]
["Mérőlap_MSE4_A1_1906031618.xls.pdf",".pdf","2019-07-22T10:11:19.221","2019-06-03T16:19:26.576","2019-07-22T10:11:18.919","U:\\Merolapok motorsor\\SPC lapok\\",null,{"$f":"MID(SPC_lapok[[#This Row],[Name]],17,10)","v":"1906031618"},2019,"6","03","16","18",null,2019,6,3,16,18,"Nappal","190603",1906030]
["Mérőlap_MSE4_A1_1906041840.xls.pdf",".pdf","2019-07-22T10:11:19.746","2019-06-04T18:41:01.398","2019-07-22T10:11:19.335","U:\\Merolapok motorsor\\SPC lapok\\",null,{"$f":"MID(SPC_lapok[[#This Row],[Name]],17,10)","v":"1906041840"},2019,"6","04","18","40",null,2019,6,4,18,40,"Ejszaka","190604",19060400]
["Mérőlap_MSE4_A1_1906042001.xls.pdf",".pdf","2019-07-22T10:11:20.131","2019-06-04T20:02:09.270","2019-07-22T10:11:19.813","U:\\Merolapok motorsor\\SPC lapok\\",null,{"$f":"MID(SPC_lapok[[#This Row],[Name]],17,10)","v":"1906042001"},2019,"6","04","20","01",null,2019,6,4,20,1,"Ejszaka","190604",19060400]
["Mérőlap_MSE4_A1_1906042202.xls.pdf",".pdf","2019-07-22T10:11:20.815","2019-06-04T22:07:36.348","2019-07-22T10:11:20.217","U:\\Merolapok motorsor\\SPC lapok\\",null,{"$f":"MID(SPC_lapok[[#This Row],[Name]],17,10)","v":"1906042202"},2019,"6","04","22","02",null,2019,6,4,22,2,"Ejszaka","190604",19060400]
["Mérőlap_MSE4_A1_1906050210.xls.pdf",".pdf","2019-07-22T10:11:21.335","2019-06-05T02:11:07.219","2019-07-22T10:11:20.942","U:\\Merolapok motorsor\\SPC lapok\\",null,{"$f":"MID(SPC_lapok[[#This Row],[Name]],17,10)","v":"1906050210"},2019,"6","05","02","10",null,2019,6,5,2,10,"Ejszaka","190605",19060400]
["Mérőlap_MSE4_A1_1906050356.xls.pdf",".pdf","2019-07-22T10:11:21.746","2019-06-05T03:57:19.694","2019-07-22T10:11:21.403","U:\\Merolapok motorsor\\SPC lapok\\",null,{"$f":"MID(SPC_lapok[[#This Row],[Name]],17,10)","v":"1906050356"},2019,"6","05","03","56",null,2019,6,5,3,56,"Ejszaka","190605",19060400]
["Mérőlap_MSE4_A1_1906061831.xls.pdf",".pdf","2019-07-22T10:11:22.345","2019-06-06T18:31:48.243","2019-07-22T10:11:21.862","U:\\Merolapok motorsor\\SPC lapok\\",null,{"$f":"MID(SPC_lapok[[#This Row],[Name]],17,10)","v":"1906061831"},2019,"6","06","18","31",null,2019,6,6,18,31,"Ejszaka","190606",19060600]
["Mérőlap_MSE4_A1_1906062153.xls.pdf",".pdf","2019-07-22T10:11:22.941","2019-06-06T21:53:58.245","2019-07-22T10:11:22.465","U:\\Merolapok motorsor\\SPC lapok\\",null,{"$f":"MID(SPC_lapok[[#This Row],[Name]],17,10)","v":"1906062153"},2019,"6","06","21","53",null,2019,6,6,21,53,"Ejszaka","190606",19060600]
["Mérőlap_MSE4_A1_1906070046.xls.pdf",".pdf","2019-07-22T10:11:23.312","2019-06-07T00:47:03.837","2019-07-22T10:11:23.007","U:\\Merolapok motorsor\\SPC lapok\\",null,{"$f":"MID(SPC_lapok[[#This Row],[Name]],17,10)","v":"1906070046"},2019,"6","07","00","46",null,2019,6,7,0,46,"Ejszaka","190607",19060600]
["Mérőlap_MSE4_A1_1906070228.xls.pdf",".pdf","2019-07-22T10:11:23.834","2019-06-07T02:28:49.746","2019-07-22T10:11:23.470","U:\\Merolapok motorsor\\SPC lapok\\",null,{"$f":"MID(SPC_lapok[[#This Row],[Name]],17,10)","v":"1906070228"},2019,"6","07","02","28",null,2019,6,7,2,28,"Ejszaka","190607",19060600]
["Mérőlap_MSE4_A1_1906071845.xls.pdf",".pdf","2019-07-22T10:11:24.206","2019-06-07T18:46:20.472","2019-07-22T10:11:23.895","U:\\Merolapok motorsor\\SPC lapok\\",null,{"$f":"MID(SPC_lapok[[#This Row],[Name]],17,10)","v":"1906071845"},2019,"6","07","18","45",null,2019,6,7,18,45,"Ejszaka","190607",19060700]
["Mérőlap_MSE4_A1_1906072003.xls.pdf",".pdf","2019-07-22T10:11:24.599","2019-06-07T20:04:10.918","2019-07-22T10:11:24.265","U:\\Merolapok motorsor\\SPC lapok\\",null,{"$f":"MID(SPC_lapok[[#This Row],[Name]],17,10)","v":"1906072003"},2019,"6","07","20","03",null,2019,6,7,20,3,"Ejszaka","190607",19060700]
["Mérőlap_MSE4_A1_1906072155.xls.pdf",".pdf","2019-07-22T10:11:25.156","2019-06-07T21:56:30.673","2019-07-22T10:11:24.735","U:\\Merolapok motorsor\\SPC lapok\\",null,{"$f":"MID(SPC_lapok[[#This Row],[Name]],17,10)","v":"1906072155"},2019,"6","07","21","55",null,2019,6,7,21,55,"Ejszaka","190607",19060700]
["Mérőlap_MSE4_A1_1906080219.xls.pdf",".pdf","2019-07-22T10:11:25.651","2019-06-08T02:20:27.577","2019-07-22T10:11:25.301","U:\\Merolapok motorsor\\SPC lapok\\",null,{"$f":"MID(SPC_lapok[[#This Row],[Name]],17,10)","v":"1906080219"},2019,"6","08","02","19",null,2019,6,8,2,19,"Ejszaka","190608",19060700]
["Mérőlap_MSE4_A1_1906080434.xls.pdf",".pdf","2019-07-22T10:11:26.118","2019-06-08T04:35:26.421","2019-07-22T10:11:25.748","U:\\Merolapok motorsor\\SPC lapok\\",null,{"$f":"MID(SPC_lapok[[#This Row],[Name]],17,10)","v":"1906080434"},2019,"6","08","04","34",null,2019,6,8,4,34,"Ejszaka","190608",19060700]
["Mérőlap_MSE4_A1_1906110639.xls.pdf",".pdf","2019-07-22T10:11:26.647","2019-06-11T06:40:27.286","2019-07-22T10:11:26.298","U:\\Merolapok motorsor\\SPC lapok\\",null,{"$f":"MID(SPC_lapok[[#This Row],[Name]],17,10)","v":"1906110639"},2019,"6","11","06","39",null,2019,6,11,6,39,"Nappal","190611",1906110]
["Mérőlap_MSE4_A1_1906110754.xls.pdf",".pdf","2019-07-22T10:11:27.268","2019-06-11T07:54:50.640","2019-07-22T10:11:26.757","U:\\Merolapok motorsor\\SPC lapok\\",null,{"$f":"MID(SPC_lapok[[#This Row],[Name]],17,10)","v":"1906110754"},2019,"6","11","07","54",null,2019,6,11,7,54,"Nappal","190611",1906110]
["Mérőlap_MSE4_A1_1906111031.xls.pdf",".pdf","2019-07-22T10:11:27.697","2019-06-11T10:33:26.992","2019-07-22T10:11:27.376","U:\\Merolapok motorsor\\SPC lapok\\",null,{"$f":"MID(SPC_lapok[[#This Row],[Name]],17,10)","v":"1906111031"},2019,"6","11","10","31",null,2019,6,11,10,31,"Nappal","190611",1906110]
["Mérőlap_MSE4_A1_1906111438.xls.pdf",".pdf","2019-07-22T10:11:28.285","2019-06-11T14:38:39.734","2019-07-22T10:11:27.814","U:\\Merolapok motorsor\\SPC lapok\\",null,{"$f":"MID(SPC_lapok[[#This Row],[Name]],17,10)","v":"1906111438"},2019,"6","11","14","38",null,2019,6,11,14,38,"Nappal","190611",1906110]
["Mérőlap_MSE4_A1_1906111616.xls.pdf",".pdf","2019-07-22T10:11:28.817","2019-06-11T16:17:07.317","2019-07-22T10:11:28.409","U:\\Merolapok motorsor\\SPC lapok\\",null,{"$f":"MID(SPC_lapok[[#This Row],[Name]],17,10)","v":"1906111616"},2019,"6","11","16","16",null,2019,6,11,16,16,"Nappal","190611",1906110]
["Mérőlap_MSE4_A1_1906141817.xls.pdf",".pdf","2019-07-22T10:11:29.338","2019-06-14T18:19:06.665","2019-07-22T10:11:29.034","U:\\Merolapok motorsor\\SPC lapok\\",null,{"$f":"MID(SPC_lapok[[#This Row],[Name]],17,10)","v":"1906141817"},2019,"6","14","18","17",null,2019,6,14,18,17,"Ejszaka","190614",19061400]
["Mérőlap_MSE4_A1_1906142019.xls.pdf",".pdf","2019-07-22T10:11:29.723","2019-06-14T20:20:21.951","2019-07-22T10:11:29.432","U:\\Merolapok motorsor\\SPC lapok\\",null,{"$f":"MID(SPC_lapok[[#This Row],[Name]],17,10)","v":"1906142019"},2019,"6","14","20","19",null,2019,6,14,20,19,"Ejszaka","190614",19061400]
["Mérőlap_MSE4_A1_1906142232.xls.pdf",".pdf","2019-07-22T10:11:30.190","2019-06-14T22:33:09.564","2019-07-22T10:11:29.801","U:\\Merolapok motorsor\\SPC lapok\\",null,{"$f":"MID(SPC_lapok[[#This Row],[Name]],17,10)","v":"1906142232"},2019,"6","14","22","32",null,2019,6,14,22,32,"Ejszaka","190614",19061400]
["Mérőlap_MSE4_A1_1906150048.xls.pdf",".pdf","2019-07-22T10:11:30.725","2019-06-15T00:49:31.412","2019-07-22T10:11:30.326","U:\\Merolapok motorsor\\SPC lapok\\",null,{"$f":"MID(SPC_lapok[[#This Row],[Name]],17,10)","v":"1906150048"},2019,"6","15","00","48",null,2019,6,15,0,48,"Ejszaka","190615",19061400]
["Mérőlap_MSE4_A1_1906150526.xls.pdf",".pdf","2019-07-22T10:11:31.112","2019-06-15T05:26:31.770","2019-07-22T10:11:30.833","U:\\Merolapok motorsor\\SPC lapok\\",null,{"$f":"MID(SPC_lapok[[#This Row],[Name]],17,10)","v":"1906150526"},2019,"6","15","05","26",null,2019,6,15,5,26,"Ejszaka","190615",19061400]
["Mérőlap_MSE4_A1_1906151830.xls.pdf",".pdf","2019-07-22T10:11:31.417","2019-06-15T18:30:46.480","2019-07-22T10:11:31.172","U:\\Merolapok motorsor\\SPC lapok\\",null,{"$f":"MID(SPC_lapok[[#This Row],[Name]],17,10)","v":"1906151830"},2019,"6","15","18","30",null,2019,6,15,18,30,"Ejszaka","190615",19061500]
["Mérőlap_MSE4_A1_1906152035.xls.pdf",".pdf","2019-07-22T10:11:31.804","2019-06-15T20:35:56.390","2019-07-22T10:11:31.478","U:\\Merolapok motorsor\\SPC lapok\\",null,{"$f":"MID(SPC_lapok[[#This Row],[Name]],17,10)","v":"1906152035"},2019,"6",{"$f":"MID(H34,5,2)","v":"15"},"20","35",null,2019,6,15,20,35,"Ejszaka","190615",19061500]
["Mérőlap_MSE4_A1_1906160147.xls.pdf",".pdf","2019-07-22T10:11:32.251","2019-06-16T01:48:36.405","2019-07-22T10:11:31.905","U:\\Merolapok motorsor\\SPC lapok\\",null,{"$f":"MID(SPC_lapok[[#This Row],[Name]],17,10)","v":"1906160147"},2019,"6","16","01","47",null,2019,6,16,1,47,"Ejszaka","190616",19061500]
["Mérőlap_MSE4_A1_1906160433.xls.pdf",".pdf","2019-07-22T10:11:32.639","2019-06-16T04:33:36.354","2019-07-22T10:11:32.356","U:\\Merolapok motorsor\\SPC lapok\\",null,{"$f":"MID(SPC_lapok[[#This Row],[Name]],17,10)","v":"1906160433"},2019,"6","16","04","33",null,2019,6,16,4,33,"Ejszaka","190616",19061500]
["Mérőlap_MSE4_A1_1906161904.xls.pdf",".pdf","2019-07-22T10:11:33.002","2019-06-16T19:05:15.474","2019-07-22T10:11:32.738","U:\\Merolapok motorsor\\SPC lapok\\",null,{"$f":"MID(SPC_lapok[[#This Row],[Name]],17,10)","v":"1906161904"},2019,"6","16","19","04",null,2019,6,16,19,4,"Ejszaka","190616",19061600]
["Mérőlap_MSE4_A1_1906162029.xls.pdf",".pdf","2019-07-22T10:11:33.406","2019-06-16T20:30:03.139","2019-07-22T10:11:33.087","U:\\Merolapok motorsor\\SPC lapok\\",null,{"$f":"MID(SPC_lapok[[#This Row],[Name]],17,10)","v":"1906162029"},2019,"6","16","20","29",null,2019,6,16,20,29,"Ejszaka","190616",19061600]
["Mérőlap_MSE4_A1_1906170139.xls.pdf",".pdf","2019-07-22T10:11:34.100","2019-06-17T01:40:37.875","2019-07-22T10:11:33.504","U:\\Merolapok motorsor\\SPC lapok\\",null,{"$f":"MID(SPC_lapok[[#This Row],[Name]],17,10)","v":"1906170139"},2019,"6","17","01","39",null,2019,6,17,1,39,"Ejszaka","190617",19061600]
["Mérőlap_MSE4_A1_1906180654.xls.pdf",".pdf","2019-07-22T10:11:34.639","2019-06-18T06:54:52.520","2019-07-22T10:11:34.237","U:\\Merolapok motorsor\\SPC lapok\\",null,{"$f":"MID(SPC_lapok[[#This Row],[Name]],17,10)","v":"1906180654"},2019,"6","18","06","54",null,2019,6,18,6,54,"Nappal","190618",1906180]
["Mérőlap_MSE4_A1_1906181235.xls.pdf",".pdf","2019-07-22T10:11:35.170","2019-06-18T12:35:58.224","2019-07-22T10:11:34.763","U:\\Merolapok motorsor\\SPC lapok\\",null,{"$f":"MID(SPC_lapok[[#This Row],[Name]],17,10)","v":"1906181235"},2019,"6","18","12","35",null,2019,6,18,12,35,"Nappal","190618",1906180]
["Mérőlap_MSE4_A1_1906181410.xls.pdf",".pdf","2019-07-22T10:11:35.757","2019-06-18T14:11:15.856","2019-07-22T10:11:35.344","U:\\Merolapok motorsor\\SPC lapok\\",null,{"$f":"MID(SPC_lapok[[#This Row],[Name]],17,10)","v":"1906181410"},2019,"6","18","14","10",null,2019,6,18,14,10,"Nappal","190618",1906180]
["Mérőlap_MSE4_A1_1906181622.xls.pdf",".pdf","2019-07-22T10:11:36.245","2019-06-18T16:22:40.782","2019-07-22T10:11:35.841","U:\\Merolapok motorsor\\SPC lapok\\",null,{"$f":"MID(SPC_lapok[[#This Row],[Name]],17,10)","v":"1906181622"},2019,"6","18","16","22",null,2019,6,18,16,22,"Nappal","190618",1906180]
["Mérőlap_MSE4_A1_1906190617.xls.pdf",".pdf","2019-07-22T10:11:36.696","2019-06-19T06:17:58.753","2019-07-22T10:11:36.351","U:\\Merolapok motorsor\\SPC lapok\\",null,{"$f":"MID(SPC_lapok[[#This Row],[Name]],17,10)","v":"1906190617"},2019,"6","19","06","17",null,2019,6,19,6,17,"Nappal","190619",1906190]
["Mérőlap_MSE4_A1_1906190956.xls.pdf",".pdf","2019-07-22T10:11:37.275","2019-06-19T09:56:49.542","2019-07-22T10:11:36.842","U:\\Merolapok motorsor\\SPC lapok\\",null,{"$f":"MID(SPC_lapok[[#This Row],[Name]],17,10)","v":"1906190956"},2019,"6","19","09","56",null,2019,6,19,9,56,"Nappal","190619",1906190]
["Mérőlap_MSE4_A1_1906191222.xls.pdf",".pdf","2019-07-22T10:11:37.685","2019-06-19T12:22:37.001","2019-07-22T10:11:37.394","U:\\Merolapok motorsor\\SPC lapok\\",null,{"$f":"MID(SPC_lapok[[#This Row],[Name]],17,10)","v":"1906191222"},2019,"6","19","12","22",null,2019,6,19,12,22,"Nappal","190619",1906190]
["Mérőlap_MSE4_A1_1906191356.xls.pdf",".pdf","2019-07-22T10:11:38.233","2019-06-19T13:57:06.744","2019-07-22T10:11:37.775","U:\\Merolapok motorsor\\SPC lapok\\",null,{"$f":"MID(SPC_lapok[[#This Row],[Name]],17,10)","v":"1906191356"},2019,"6","19","13","56",null,2019,6,19,13,56,"Nappal","190619",1906190]
["Mérőlap_MSE4_A1_1906221818.xls.pdf",".pdf","2019-07-22T10:11:38.905","2019-06-22T18:19:26.211","2019-07-22T10:11:38.410","U:\\Merolapok motorsor\\SPC lapok\\",null,{"$f":"MID(SPC_lapok[[#This Row],[Name]],17,10)","v":"1906221818"},2019,"6","22","18","18",null,2019,6,22,18,18,"Ejszaka","190622",19062200]
["Mérőlap_MSE4_A1_1906222008.xls.pdf",".pdf","2019-07-22T10:11:39.359","2019-06-22T20:08:50.139","2019-07-22T10:11:38.995","U:\\Merolapok motorsor\\SPC lapok\\",null,{"$f":"MID(SPC_lapok[[#This Row],[Name]],17,10)","v":"1906222008"},2019,"6","22","20","08",null,2019,6,22,20,8,"Ejszaka","190622",19062200]
["Mérőlap_MSE4_A1_1906230031.xls.pdf",".pdf","2019-07-22T10:11:39.812","2019-06-23T00:31:43.240","2019-07-22T10:11:39.457","U:\\Merolapok motorsor\\SPC lapok\\",null,{"$f":"MID(SPC_lapok[[#This Row],[Name]],17,10)","v":"1906230031"},2019,"6","23","00","31",null,2019,6,23,0,31,"Ejszaka","190623",19062200]
["Mérőlap_MSE4_A1_1906230235.xls.pdf",".pdf","2019-07-22T10:11:40.551","2019-06-23T02:36:02.733","2019-07-22T10:11:40.063","U:\\Merolapok motorsor\\SPC lapok\\",null,{"$f":"MID(SPC_lapok[[#This Row],[Name]],17,10)","v":"1906230235"},2019,"6","23","02","35",null,2019,6,23,2,35,"Ejszaka","190623",19062200]
["Mérőlap_MSE4_A1_1906230355.xls.pdf",".pdf","2019-07-22T10:11:41.315","2019-06-23T03:56:22.075","2019-07-22T10:11:41.088","U:\\Merolapok motorsor\\SPC lapok\\",null,{"$f":"MID(SPC_lapok[[#This Row],[Name]],17,10)","v":"1906230355"},2019,"6","23","03","55",null,2019,6,23,3,51,"Ejszaka","190623",19062200]
["Mérőlap_MSE4_A1_1906230351.xls.pdf",".pdf","2019-07-22T10:11:40.977","2019-06-23T03:58:02.936","2019-07-22T10:11:40.713","U:\\Merolapok motorsor\\SPC lapok\\",null,{"$f":"MID(SPC_lapok[[#This Row],[Name]],17,10)","v":"1906230351"},2019,"6","23","03","51",null,2019,6,23,3,55,"Ejszaka","190623",19062200]
["Mérőlap_MSE4_A1_1906231822.xls.pdf",".pdf","2019-07-22T10:11:41.730","2019-06-23T18:23:21.618","2019-07-22T10:11:41.447","U:\\Merolapok motorsor\\SPC lapok\\",null,{"$f":"MID(SPC_lapok[[#This Row],[Name]],17,10)","v":"1906231822"},2019,"6","23","18","22",null,2019,6,23,18,22,"Ejszaka","190623",19062300]
["Mérőlap_MSE4_A1_1906240108.xls.pdf",".pdf","2019-07-22T10:11:42.688","2019-06-24T01:09:28.999","2019-07-22T10:11:41.910","U:\\Merolapok motorsor\\SPC lapok\\",null,{"$f":"MID(SPC_lapok[[#This Row],[Name]],17,10)","v":"1906240108"},2019,"6","24","01","08",null,2019,6,24,1,8,"Ejszaka","190624",19062300]
["Mérőlap_MSE4_A1_1906240246.xls.pdf",".pdf","2019-07-22T10:11:43.341","2019-06-24T02:46:54.738","2019-07-22T10:11:42.862","U:\\Merolapok motorsor\\SPC lapok\\",null,{"$f":"MID(SPC_lapok[[#This Row],[Name]],17,10)","v":"1906240246"},2019,"6","24","02","46",null,2019,6,24,2,46,"Ejszaka","190624",19062300]
["Mérőlap_MSE4_A1_1906240432.xls.pdf",".pdf","2019-07-22T10:11:43.880","2019-06-24T04:33:20.574","2019-07-22T10:11:43.457","U:\\Merolapok motorsor\\SPC lapok\\",null,{"$f":"MID(SPC_lapok[[#This Row],[Name]],17,10)","v":"1906240432"},2019,"6","24","04","32",null,2019,6,24,4,32,"Ejszaka","190624",19062300]
["Mérőlap_MSE4_A1_1906260708.xls.pdf",".pdf","2019-07-22T10:11:44.741","2019-06-26T07:12:33","2019-07-22T10:11:44.106","U:\\Merolapok motorsor\\SPC lapok\\",null,{"$f":"MID(SPC_lapok[[#This Row],[Name]],17,10)","v":"1906260708"},2019,"6","26","07","08",null,2019,6,26,7,8,"Nappal","190626",1906260]
["Mérőlap_MSE4_A1_1906260821.xls.pdf",".pdf","2019-07-22T10:11:45.352","2019-06-26T08:22:16.781","2019-07-22T10:11:44.996","U:\\Merolapok motorsor\\SPC lapok\\",null,{"$f":"MID(SPC_lapok[[#This Row],[Name]],17,10)","v":"1906260821"},2019,"6","26","08","21",null,2019,6,26,8,21,"Nappal","190626",1906260]
["Mérőlap_MSE4_A1_1906261018.xls.pdf",".pdf","2019-07-22T10:11:45.947","2019-06-26T10:19:47.888","2019-07-22T10:11:45.576","U:\\Merolapok motorsor\\SPC lapok\\",null,{"$f":"MID(SPC_lapok[[#This Row],[Name]],17,10)","v":"1906261018"},2019,"6","26","10","18",null,2019,6,26,10,18,"Nappal","190626",1906260]
["Mérőlap_MSE4_A1_1906261206.xls.pdf",".pdf","2019-07-22T10:11:46.448","2019-06-26T12:07:49.105","2019-07-22T10:11:46.130","U:\\Merolapok motorsor\\SPC lapok\\",null,{"$f":"MID(SPC_lapok[[#This Row],[Name]],17,10)","v":"1906261206"},2019,"6","26","12","06",null,2019,6,26,12,6,"Nappal","190626",1906260]
["Mérőlap_MSE4_A1_1906261443.xls.pdf",".pdf","2019-07-22T10:11:47.535","2019-06-26T14:44:33.405","2019-07-22T10:11:46.839","U:\\Merolapok motorsor\\SPC lapok\\",null,{"$f":"MID(SPC_lapok[[#This Row],[Name]],17,10)","v":"1906261443"},2019,"6","26","14","43",null,2019,6,26,14,43,"Nappal","190626",1906260]
["Mérőlap_MSE4_A1_1906261620.xls.pdf",".pdf","2019-07-22T10:11:48.457","2019-06-26T16:24:57.215","2019-07-22T10:11:47.846","U:\\Merolapok motorsor\\SPC lapok\\",null,{"$f":"MID(SPC_lapok[[#This Row],[Name]],17,10)","v":"1906261620"},2019,"6","26","16","20",null,2019,6,26,16,20,"Nappal","190626",1906260]
["Mérőlap_MSE4_A1_1906270619.xls.pdf",".pdf","2019-07-22T10:11:49.076","2019-06-27T06:20:12.466","2019-07-22T10:11:48.717","U:\\Merolapok motorsor\\SPC lapok\\",null,{"$f":"MID(SPC_lapok[[#This Row],[Name]],17,10)","v":"1906270619"},2019,"6","27","06","19",null,2019,6,27,6,19,"Nappal","190627",1906270]
["Mérőlap_MSE4_A1_1906270934.xls.pdf",".pdf","2019-07-22T10:11:49.623","2019-06-27T09:35:17.440","2019-07-22T10:11:49.170","U:\\Merolapok motorsor\\SPC lapok\\",null,{"$f":"MID(SPC_lapok[[#This Row],[Name]],17,10)","v":"1906270934"},2019,"6","27","09","34",null,2019,6,27,9,34,"Nappal","190627",1906270]
["Mérőlap_MSE4_A1_1906271147.xls.pdf",".pdf","2019-07-22T10:11:50.043","2019-06-27T11:47:40.792","2019-07-22T10:11:49.740","U:\\Merolapok motorsor\\SPC lapok\\",null,{"$f":"MID(SPC_lapok[[#This Row],[Name]],17,10)","v":"1906271147"},2019,"6",{"$f":"MID(H66,5,2)","v":"27"},"11","47",null,2019,6,27,11,47,"Nappal","190627",1906270]
["Mérőlap_MSE4_A1_1906271559.xls.pdf",".pdf","2019-07-22T10:11:50.570","2019-06-27T16:00:38.870","2019-07-22T10:11:50.198","U:\\Merolapok motorsor\\SPC lapok\\",null,{"$f":"MID(SPC_lapok[[#This Row],[Name]],17,10)","v":"1906271559"},2019,{"$f":"MID(H67,4,1)","v":"6"},"27",{"$f":"MID(H67,7,2)","v":"15"},{"$f":"MID(H67,9,2)","v":"59"},null,2019,6,27,15,59,{"$f":"IF(R67<6,\"Ejszaka\",IF(R67<18,\"Nappal\",\"Ejszaka\"))","v":"Nappal"},{"$f":"MID(H67,1,6)","v":"190627"},{"$f":"IF(T67=\"Nappal\",U67*10,IF(R67<6,U67*100-100,U67*100))","v":1906270}]
["Mérőlap_MSE4_A1_1906280631.xls.pdf",".pdf","2019-07-22T10:11:51.415","2019-06-28T06:32:02.816","2019-07-22T10:11:50.714","U:\\Merolapok motorsor\\SPC lapok\\",null,{"$f":"MID(SPC_lapok[[#This Row],[Name]],17,10)","v":"1906280631"},2019,"6","28","06","31",null,2019,6,28,6,31,"Nappal","190628",1906280]
["Mérőlap_MSE4_A1_1906280813.xls.pdf",".pdf","2019-07-22T10:11:52.011","2019-06-28T08:13:50.077","2019-07-22T10:11:51.523","U:\\Merolapok motorsor\\SPC lapok\\",null,{"$f":"MID(SPC_lapok[[#This Row],[Name]],17,10)","v":"1906280813"},2019,"6","28","08","13",null,2019,6,28,8,13,"Nappal","190628",1906280]
["Mérőlap_MSE4_A1_1906281002.xls.pdf",".pdf","2019-07-22T10:11:52.508","2019-06-28T10:03:26.332","2019-07-22T10:11:52.149","U:\\Merolapok motorsor\\SPC lapok\\",null,{"$f":"MID(SPC_lapok[[#This Row],[Name]],17,10)","v":"1906281002"},2019,"6","28","10","02",null,2019,6,28,10,2,"Nappal","190628",1906280]
["Mérőlap_MSE4_A1_1906281243.xls.pdf",".pdf","2019-07-22T10:11:52.982","2019-06-28T12:44:08.527","2019-07-22T10:11:52.615","U:\\Merolapok motorsor\\SPC lapok\\",null,{"$f":"MID(SPC_lapok[[#This Row],[Name]],17,10)","v":"1906281243"},2019,"6","28","12","43",null,2019,6,28,12,43,"Nappal","190628",1906280]
["Mérőlap_MSE4_A1_1906281403.xls.pdf",".pdf","2019-07-22T10:11:53.453","2019-06-28T14:04:17.276","2019-07-22T10:11:53.097","U:\\Merolapok motorsor\\SPC lapok\\",null,{"$f":"MID(SPC_lapok[[#This Row],[Name]],17,10)","v":"1906281403"},2019,"6","28","14","03",null,2019,6,28,14,3,"Nappal","190628",1906280]
["Mérőlap_MSE4_A1_1906281622.xls.pdf",".pdf","2019-07-22T10:11:54.031","2019-06-28T16:23:13.708","2019-07-22T10:11:53.575","U:\\Merolapok motorsor\\SPC lapok\\",null,{"$f":"MID(SPC_lapok[[#This Row],[Name]],17,10)","v":"1906281622"},2019,"6","28","16","22",null,2019,6,28,16,22,"Nappal","190628",1906280]
["Mérőlap_MSE4_A1_1906302010.xls.pdf",".pdf","2019-07-22T10:11:54.530","2019-06-30T20:11:15.669","2019-07-22T10:11:54.193","U:\\Merolapok motorsor\\SPC lapok\\",null,{"$f":"MID(SPC_lapok[[#This Row],[Name]],17,10)","v":"1906302010"},2019,"6","30","20","10",null,2019,6,30,20,10,"Ejszaka","190630",19063000]
["Mérőlap_MSE4_A1_1906302148.xls.pdf",".pdf","2019-07-22T10:11:55.210","2019-06-30T21:49:31.411","2019-07-22T10:11:54.691","U:\\Merolapok motorsor\\SPC lapok\\",null,{"$f":"MID(SPC_lapok[[#This Row],[Name]],17,10)","v":"1906302148"},2019,"6","30","21","48",null,2019,6,30,21,48,"Ejszaka","190630",19063000]
["Mérőlap_MSE4_A1_1907010040.xls.pdf",".pdf","2019-07-22T10:11:55.812","2019-07-01T00:40:56.914","2019-07-22T10:11:55.279","U:\\Merolapok motorsor\\SPC lapok\\",null,{"$f":"MID(SPC_lapok[[#This Row],[Name]],17,10)","v":"1907010040"},2019,"7","01","00","40",null,2019,7,1,0,40,"Ejszaka","190701",19070000]
["Mérőlap_MSE4_A1_1907010231.xls.pdf",".pdf","2019-07-22T10:11:56.480","2019-07-01T02:31:49.234","2019-07-22T10:11:56.013","U:\\Merolapok motorsor\\SPC lapok\\",null,{"$f":"MID(SPC_lapok[[#This Row],[Name]],17,10)","v":"1907010231"},2019,"7","01","02","31",null,2019,7,1,2,31,"Ejszaka","190701",19070000]
["Mérőlap_MSE4_A1_1907010430.xls.pdf",".pdf","2019-07-22T10:11:56.881","2019-07-01T04:30:40.605","2019-07-22T10:11:56.555","U:\\Merolapok motorsor\\SPC lapok\\",null,{"$f":"MID(SPC_lapok[[#This Row],[Name]],17,10)","v":"1907010430"},2019,"7","01","04","30",null,2019,7,1,4,30,"Ejszaka","190701",19070000]
["Mérőlap_MSE4_A1_1907011854.xls.pdf",".pdf","2019-07-22T10:11:57.270","2019-07-01T18:55:01.511","2019-07-22T10:11:56.983","U:\\Merolapok motorsor\\SPC lapok\\",null,{"$f":"MID(SPC_lapok[[#This Row],[Name]],17,10)","v":"1907011854"},2019,"7","01","18","54",null,2019,7,1,18,54,"Ejszaka","190701",19070100]
["Mérőlap_MSE4_A1_1907012021.xls.pdf",".pdf","2019-07-22T10:11:57.825","2019-07-01T20:22:24.078","2019-07-22T10:11:57.355","U:\\Merolapok motorsor\\SPC lapok\\",null,{"$f":"MID(SPC_lapok[[#This Row],[Name]],17,10)","v":"1907012021"},2019,"7","01","20","21",null,2019,7,1,20,21,"Ejszaka","190701",19070100]
["Mérőlap_MSE4_A1_1907012240.xls.pdf",".pdf","2019-07-22T10:11:58.591","2019-07-01T22:41:02.561","2019-07-22T10:11:57.957","U:\\Merolapok motorsor\\SPC lapok\\",null,{"$f":"MID(SPC_lapok[[#This Row],[Name]],17,10)","v":"1907012240"},2019,"7","01","22","40",null,2019,7,1,22,40,"Ejszaka","190701",19070100]
["Mérőlap_MSE4_A1_1907020457.xls.pdf",".pdf","2019-07-22T10:11:58.983","2019-07-02T05:12:30.101","2019-07-22T10:11:58.713","U:\\Merolapok motorsor\\SPC lapok\\",null,{"$f":"MID(SPC_lapok[[#This Row],[Name]],17,10)","v":"1907020457"},2019,"7","02","04","57",null,2019,7,2,4,57,"Ejszaka","190702",19070100]
["Mérőlap_MSE4_A1_1907040618.xls.pdf",".pdf","2019-07-22T10:11:59.422","2019-07-04T06:19:01.772","2019-07-22T10:11:59.063","U:\\Merolapok motorsor\\SPC lapok\\",null,{"$f":"MID(SPC_lapok[[#This Row],[Name]],17,10)","v":"1907040618"},2019,"7","04","06","18",null,2019,7,4,6,18,"Nappal","190704",1907040]
["Mérőlap_MSE4_A1_1907040832.xls.pdf",".pdf","2019-07-22T10:11:59.873","2019-07-04T08:33:23.267","2019-07-22T10:11:59.541","U:\\Merolapok motorsor\\SPC lapok\\",null,{"$f":"MID(SPC_lapok[[#This Row],[Name]],17,10)","v":"1907040832"},2019,"7","04","08","32",null,2019,7,4,8,32,"Nappal","190704",1907040]
["Mérőlap_MSE4_A1_1907041025.xls.pdf",".pdf","2019-07-22T10:11:06.852","2019-07-04T10:26:31.907","2019-07-22T10:11:06.276","U:\\Merolapok motorsor\\SPC lapok\\",null,{"$f":"MID(SPC_lapok[[#This Row],[Name]],17,10)","v":"1907041025"},2019,"7","04","10","25",null,2019,7,4,10,25,"Nappal","190704",1907040]
["Mérőlap_MSE4_A1_1907041424.xls.pdf",".pdf","2019-07-22T10:11:07.340","2019-07-04T14:24:38.420","2019-07-22T10:11:07.042","U:\\Merolapok motorsor\\SPC lapok\\",null,{"$f":"MID(SPC_lapok[[#This Row],[Name]],17,10)","v":"1907041424"},2019,"7","04","14","24",null,2019,7,4,14,24,"Nappal","190704",1907040]
["Mérőlap_MSE4_A1_1907041629.xls.pdf",".pdf","2019-07-22T10:11:07.624","2019-07-04T16:30:15.226","2019-07-22T10:11:07.396","U:\\Merolapok motorsor\\SPC lapok\\",null,{"$f":"MID(SPC_lapok[[#This Row],[Name]],17,10)","v":"1907041629"},2019,"7","04","16","29",null,2019,7,4,16,29,"Nappal","190704",1907040]
["Mérőlap_MSE4_A1_1907050616.xls.pdf",".pdf","2019-07-22T10:11:07.922","2019-07-05T06:17:13.069","2019-07-22T10:11:07.693","U:\\Merolapok motorsor\\SPC lapok\\",null,{"$f":"MID(SPC_lapok[[#This Row],[Name]],17,10)","v":"1907050616"},2019,"7","05","06","16",null,2019,7,5,6,16,"Nappal","190705",1907050]
["Mérőlap_MSE4_A1_1907050848.xls.pdf",".pdf","2019-07-22T10:11:08.381","2019-07-05T08:48:39.151","2019-07-22T10:11:07.998","U:\\Merolapok motorsor\\SPC lapok\\",null,{"$f":"MID(SPC_lapok[[#This Row],[Name]],17,10)","v":"1907050848"},2019,"7","05","08","48",null,2019,7,5,8,48,"Nappal","190705",1907050]
["Mérőlap_MSE4_A1_1907051023.xls.pdf",".pdf","2019-07-22T10:11:08.841","2019-07-05T10:23:57.508","2019-07-22T10:11:08.442","U:\\Merolapok motorsor\\SPC lapok\\",null,{"$f":"MID(SPC_lapok[[#This Row],[Name]],17,10)","v":"1907051023"},2019,"7","05","10","23",null,2019,7,5,10,23,"Nappal","190705",1907050]
["Mérőlap_MSE4_A1_1907051215.xls.pdf",".pdf","2019-07-22T10:11:09.333","2019-07-05T12:16:04.364","2019-07-22T10:11:08.992","U:\\Merolapok motorsor\\SPC lapok\\",null,{"$f":"MID(SPC_lapok[[#This Row],[Name]],17,10)","v":"1907051215"},2019,"7","05","12","15",null,2019,7,5,12,15,"Nappal","190705",1907050]
["Mérőlap_MSE4_A1_1907051644.xls.pdf",".pdf","2019-07-22T10:11:09.745","2019-07-05T16:45:13.585","2019-07-22T10:11:09.435","U:\\Merolapok motorsor\\SPC lapok\\",null,{"$f":"MID(SPC_lapok[[#This Row],[Name]],17,10)","v":"1907051644"},2019,"7","05","16","44",null,2019,7,5,16,44,"Nappal","190705",1907050]
["Mérőlap_MSE4_A1_1907081821.xls.pdf",".pdf","2019-07-22T10:11:10.197","2019-07-08T18:22:26.330","2019-07-22T10:11:09.833","U:\\Merolapok motorsor\\SPC lapok\\",null,{"$f":"MID(SPC_lapok[[#This Row],[Name]],17,10)","v":"1907081821"},2019,"7","08","18","21",null,2019,7,8,18,21,"Ejszaka","190708",19070800]
["Mérőlap_MSE4_A1_1907082051.xls.pdf",".pdf","2019-07-22T10:11:10.784","2019-07-08T20:52:15.184","2019-07-22T10:11:10.304","U:\\Merolapok motorsor\\SPC lapok\\",null,{"$f":"MID(SPC_lapok[[#This Row],[Name]],17,10)","v":"1907082051"},2019,"7","08","20","51",null,2019,7,8,20,51,"Ejszaka","190708",19070800]
["Mérőlap_MSE4_A1_1907082242.xls.pdf",".pdf","2019-07-22T10:11:11.213","2019-07-08T22:43:23.469","2019-07-22T10:11:10.909","U:\\Merolapok motorsor\\SPC lapok\\",null,{"$f":"MID(SPC_lapok[[#This Row],[Name]],17,10)","v":"1907082242"},2019,"7","08","22","42",null,2019,7,8,22,42,"Ejszaka","190708",19070800]
["Mérőlap_MSE4_A1_1907090229.xls.pdf",".pdf","2019-07-22T10:11:11.617","2019-07-09T02:30:13.167","2019-07-22T10:11:11.270","U:\\Merolapok motorsor\\SPC lapok\\",null,{"$f":"MID(SPC_lapok[[#This Row],[Name]],17,10)","v":"1907090229"},2019,"7","09","02","29",null,2019,7,9,2,29,"Ejszaka","190709",19070800]
["Mérőlap_MSE4_A1_1907090422.xls.pdf",".pdf","2019-07-22T10:11:12.213","2019-07-09T04:22:40.511","2019-07-22T10:11:11.774","U:\\Merolapok motorsor\\SPC lapok\\",null,{"$f":"MID(SPC_lapok[[#This Row],[Name]],17,10)","v":"1907090422"},2019,"7","09","04","22",null,2019,7,9,4,22,"Ejszaka","190709",19070800]
["Mérőlap_MSE4_A1_1907120723.xls.pdf",".pdf","2019-07-22T10:11:12.836","2019-07-12T07:28:45.954","2019-07-22T10:11:12.359","U:\\Merolapok motorsor\\SPC lapok\\",null,{"$f":"MID(SPC_lapok[[#This Row],[Name]],17,10)","v":"1907120723"},2019,"7",{"$f":"MID(H98,5,2)","v":"12"},"07","23",null,2019,7,12,7,23,"Nappal","190712",1907120]
["Mérőlap_MSE4_A1_1907121236.xls.pdf",".pdf","2019-07-22T10:11:13.298","2019-07-12T12:37:25.046","2019-07-22T10:11:13.032","U:\\Merolapok motorsor\\SPC lapok\\",null,{"$f":"MID(SPC_lapok[[#This Row],[Name]],17,10)","v":"1907121236"},2019,"7","12","12","36",null,2019,7,12,12,36,"Nappal","190712",1907120]
["Mérőlap_MSE4_A1_1907121525.xls.pdf",".pdf","2019-07-22T10:11:14.069","2019-07-12T15:26:51.030","2019-07-22T10:11:13.608","U:\\Merolapok motorsor\\SPC lapok\\",null,{"$f":"MID(SPC_lapok[[#This Row],[Name]],17,10)","v":"1907121525"},2019,"7","12","15","25",null,2019,7,12,15,25,"Nappal","190712",1907120]
["Mérőlap_MSE4_A1_1907130618.xls.pdf",".pdf","2019-07-22T10:11:14.724","2019-07-13T06:18:53.896","2019-07-22T10:11:14.249","U:\\Merolapok motorsor\\SPC lapok\\",null,{"$f":"MID(SPC_lapok[[#This Row],[Name]],17,10)","v":"1907130618"},2019,"7","13","06","18",null,2019,7,13,6,18,"Nappal","190713",1907130]
["Mérőlap_MSE4_A1_1907130812.xls.pdf",".pdf","2019-07-22T10:11:15.304","2019-07-13T08:13:33.055","2019-07-22T10:11:14.817","U:\\Merolapok motorsor\\SPC lapok\\",null,{"$f":"MID(SPC_lapok[[#This Row],[Name]],17,10)","v":"1907130812"},2019,"7","13","08","12",null,2019,7,13,8,12,"Nappal","190713",1907130]
["Mérőlap_MSE4_A1_1907131313.xls.pdf",".pdf","2019-07-22T10:11:15.894","2019-07-13T13:14:22.603","2019-07-22T10:11:15.366","U:\\Merolapok motorsor\\SPC lapok\\",null,{"$f":"MID(SPC_lapok[[#This Row],[Name]],17,10)","v":"1907131313"},2019,"7","13","13","13",null,2019,7,13,13,13,"Nappal","190713",1907130]
["Mérőlap_MSE4_A1_1907131603.xls.pdf",".pdf","2019-07-22T10:11:16.379","2019-07-13T16:03:59.654","2019-07-22T10:11:16.004","U:\\Merolapok motorsor\\SPC lapok\\",null,{"$f":"MID(SPC_lapok[[#This Row],[Name]],17,10)","v":"1907131603"},2019,"7","13","16","03",null,2019,7,13,16,3,"Nappal","190713",1907130]